package update-manager 1:0.87.27 failed to install/upgrade: ErrorMessage: SystemError in cache.commit(): E:Sub-process /usr/bin/dpkg returned an error code (1)

Bug #237491 reported by udude on 2008-06-04
0
Affects Status Importance Assigned to Milestone
plucker (Ubuntu)
Undecided
Unassigned

Bug Description

Binary package hint: update-manager

message is "sorry, the package 'plucker' failed to install or upgrade'

ProblemType: Package
Architecture: i386
Date: Wed Jun 4 16:29:22 2008
DistroRelease: Ubuntu 8.04
ErrorMessage: ErrorMessage: SystemError in cache.commit(): E:Sub-process /usr/bin/dpkg returned an error code (1)

NonfreeKernelModules: nvidia
Package: update-manager 1:0.87.27
PackageArchitecture: all
SourcePackage: update-manager
Title: package update-manager 1:0.87.27 failed to install/upgrade: ErrorMessage: SystemError in cache.commit(): E:Sub-process /usr/bin/dpkg returned an error code (1)
Uname: Linux 2.6.22-14-generic i686

udude (igal) wrote :
Michael Vogt (mvo) wrote :

Here is what causes the error:

Setting up plucker (1.8-24) ...
file does not exist: /usr/lib/python2.5/site-packages/PyPlucker/Writer.py
file does not exist: /usr/lib/python2.5/site-packages/PyPlucker/__init__.py
file does not exist: /usr/lib/python2.5/site-packages/PyPlucker/helper/CharsetMapping.py
file does not exist: /usr/lib/python2.5/site-packages/PyPlucker/helper/PQAAppInfo.py
file does not exist: /usr/lib/python2.5/site-packages/PyPlucker/helper/__init__.py
file does not exist: /usr/lib/python2.5/site-packages/PyPlucker/helper/dict.py
file does not exist: /usr/lib/python2.5/site-packages/PyPlucker/helper/doc_compress.py
file does not exist: /usr/lib/python2.5/site-packages/PyPlucker/helper/gettext.py
file does not exist: /usr/lib/python2.5/site-packages/PyPlucker/helper/prc.py
file does not exist: /usr/lib/python2.5/site-packages/PyPlucker/helper/timeoutsocket.py
file does not exist: /usr/lib/python2.5/site-packages/PyPlucker/pluck-comics.py
pycentral: pycentral bccompile: error byte-compiling package `plucker'
pycentral bccompile: error byte-compiling package `plucker'
dpkg: error processing plucker (--configure):
 subprocess post-installation script returned error exit status 1

I reassign.

To post a comment you must log in.
This report contains Public information  Edit
Everyone can see this information.

Other bug subscribers