pkg-config ftbfs in disco

Bug #1823434 reported by Matthias Klose on 2019-04-06
6
This bug affects 1 person
Affects Status Importance Assigned to Milestone
pkg-config (Ubuntu)
Status tracked in Eoan
Eoan
High
Unassigned

Bug Description

https://launchpadlibrarian.net/417924357/buildlog_ubuntu-disco-amd64.pkg-config_0.29.1-0ubuntu2_BUILDING.txt.gz

PASS: check-version
PASS: check-requires-version
../pkg-config --list-all :
'sub1 Subdirectory package 1 - Test package 1 for subdirectory
broken Broken package - Module with broken .pc file
sub2 Subdirectory package 2 - Test package 2 for subdirectory' != 'sub1 Subdirectory package 1 - Test package 1 for subdirectory
sub2 Subdirectory package 2 - Test package 2 for subdirectory
broken Broken package - Module with broken .pc file'
FAIL: check-print-options
PASS: check-path
PASS: check-sysroot
PASS: check-uninstalled
PASS: check-debug
PASS: check-gtk
PASS: check-tilde
PASS: check-relocatable
PASS: check-variable-override
PASS: check-variables
==============================================================================
1 of 28 tests failed
Please report to https://bugs.freedesktop.org/enter_bug.cgi?product=pkg-config
==============================================================================
make[3]: *** [Makefile:411: check-TESTS] Error 1
make[3]: Leaving directory '/<<PKGBUILDDIR>>/check'
make[2]: *** [Makefile:537: check-am] Error 2
make[2]: Leaving directory '/<<PKGBUILDDIR>>/check'
make[1]: *** [Makefile:715: check-recursive] Error 1
make[1]: Leaving directory '/<<PKGBUILDDIR>>'
dh_auto_test: make -j1 check VERBOSE=1 returned exit code 2
make: *** [debian/rules:22: build] Error 2

Matthias Klose (doko) on 2019-04-06
Changed in pkg-config (Ubuntu):
importance: Undecided → High
tags: added: ftbfs rls-dd-incoming
tags: added: rls-ee-incoming
tags: removed: rls-dd-incoming
Steve Langasek (vorlon) on 2019-06-06
Changed in pkg-config (Ubuntu Eoan):
status: New → Triaged
Launchpad Janitor (janitor) wrote :

This bug was fixed in the package pkg-config - 0.29.1-0ubuntu3

---------------
pkg-config (0.29.1-0ubuntu3) eoan; urgency=medium

  * debian/patches/test-list-all-arbitrary-order.patch: Fix wrong test
    of pkg-config --list-all output. Closes LP: #1823434.

 -- Steve Langasek <email address hidden> Thu, 06 Jun 2019 20:30:50 +0000

Changed in pkg-config (Ubuntu Eoan):
status: Triaged → Fix Released
To post a comment you must log in.
This report contains Public information  Edit
Everyone can see this information.

Other bug subscribers