pads version 1.2-10 failed to build on amd64 with GCC-4.6/oneiric

Bug #770979 reported by Matthias Klose on 2011-04-26
6
This bug affects 1 person
Affects Status Importance Assigned to Milestone
pads (Debian)
Confirmed
Unknown
pads (Ubuntu)
High
Unassigned
Oneiric
High
Unassigned

Bug Description

pads version 1.2-10 failed to build on amd64 with GCC-4.6/oneiric
Link to failed build: https://launchpad.net/ubuntu/+archive/test-rebuild-20110413/+buildjob/2464342

Details about the rebuild:
https://lists.ubuntu.com/archives/ubuntu-devel/2011-April/033042.html

Direct link to the build log: https://launchpad.net/ubuntu/+archive/test-rebuild-20110413/+buildjob/2464342/+files/buildlog_ubuntu-natty-amd64.pads_1.2-10_FAILEDTOBUILD.txt.gz

This log snippet might be of interest, since it triggered the matcher 'Purging chroot-autobuild'.
Excerpt 637 lines into the build log:

identification.o: In function `get_app_name':
/build/buildd/pads-1.2/src/identification.c:338: undefined reference to `pcre_copy_substring'
identification.o: In function `pcre_identify':
/build/buildd/pads-1.2/src/identification.c:272: undefined reference to `pcre_exec'
collect2: ld returned 1 exit status
make[4]: *** [pads] Error 1
make[4]: Leaving directory `/build/buildd/pads-1.2/src'
make[3]: *** [all-recursive] Error 1
make[3]: Leaving directory `/build/buildd/pads-1.2/src'
make[2]: *** [all-recursive] Error 1
make[2]: Leaving directory `/build/buildd/pads-1.2'
make[1]: *** [all] Error 2
make[1]: Leaving directory `/build/buildd/pads-1.2'
make: *** [build-stamp] Error 2
dpkg-buildpackage: error: debian/rules build gave error exit status 2
******************************************************************************
Build finished at 20110425-0931
FAILED [dpkg-buildpackage died]
Purging chroot-autobuild/build/buildd/pads-1.2

Related branches

Matthias Klose (doko) on 2011-04-26
Changed in pads (Ubuntu):
importance: Undecided → High
Changed in pads (Ubuntu):
milestone: none → oneiric-alpha-3
Julian Taylor (jtaylor) on 2011-06-29
Changed in pads (Ubuntu Oneiric):
assignee: nobody → Julian Taylor (jtaylor)
status: New → In Progress
Julian Taylor (jtaylor) wrote :

patch available in the debian bug

tags: added: patch-forwarded-debian
Changed in pads (Ubuntu Oneiric):
milestone: oneiric-alpha-3 → none
tags: added: universe
Changed in pads (Debian):
status: Unknown → Confirmed
Julian Taylor (jtaylor) on 2011-08-21
Changed in pads (Ubuntu Oneiric):
assignee: Julian Taylor (jtaylor) → nobody
status: In Progress → Triaged
Launchpad Janitor (janitor) wrote :

This bug was fixed in the package pads - 1.2-11ubuntu1

---------------
pads (1.2-11ubuntu1) oneiric; urgency=low

  * patch configure to use LIBS instead of LD_FLAGS
    - fixes build with ld --as-needed (LP: #770979)
 -- Julian Taylor <email address hidden> Sun, 21 Aug 2011 16:37:01 +0200

Changed in pads (Ubuntu Oneiric):
status: Triaged → Fix Released
To post a comment you must log in.
This report contains Public information  Edit
Everyone can see this information.

Other bug subscribers

Remote bug watches

Bug watches keep track of this bug in other bug trackers.