opendrim-lmp-dhcp version 1.0.0-0ubuntu1 failed to build on i386

Bug #756020 reported by Matthias Klose on 2011-04-10
6
This bug affects 1 person
Affects Status Importance Assigned to Milestone
opendrim-lmp-dhcp (Ubuntu)
High
Sebastian Carneiro
Oneiric
High
Sebastian Carneiro

Bug Description

opendrim-lmp-dhcp version 1.0.0-0ubuntu1 failed to build on i386
Link to failed build: https://launchpad.net/ubuntu/+archive/test-rebuild-20110329/+buildjob/2406179

Direct link to the build log: https://launchpad.net/ubuntu/+archive/test-rebuild-20110329/+buildjob/2406179/+files/buildlog_ubuntu-natty-i386.opendrim-lmp-dhcp_1.0.0-0ubuntu1_FAILEDTOBUILD.txt.gz

This log snippet might be of interest, since it triggered the matcher 'Purging chroot-autobuild'.
Excerpt 1377 lines into the build log:

mv -f .deps/testOpenDRIM_DHCPElementSettingData-testOpenDRIM_DHCPElementSettingData.Tpo .deps/testOpenDRIM_DHCPElementSettingData-testOpenDRIM_DHCPElementSettingData.Po
/bin/bash ../libtool --tag=CXX --mode=link g++ -Wall -Wunused -fPIC -fno-rtti -fno-exceptions -O2 -g -O2 -Wl,-Bsymbolic-functions -L. -L/usr/lib/cmpi -L/usr/lib/cmpi -o testOpenDRIM_DHCPElementSettingData testOpenDRIM_DHCPElementSettingData-testOpenDRIM_DHCPElementSettingData.o ../OpenDRIM_DHCPElementSettingData/libcmpiDHCP_OpenDRIM_DHCPElementSettingDataProvider.la
libtool: link: g++ -Wall -Wunused -fPIC -fno-rtti -fno-exceptions -O2 -g -O2 -Wl,-Bsymbolic-functions -o .libs/testOpenDRIM_DHCPElementSettingData testOpenDRIM_DHCPElementSettingData-testOpenDRIM_DHCPElementSettingData.o -L/build/buildd/opendrim-lmp-dhcp-1.0.0/test -L/usr/lib/cmpi ../OpenDRIM_DHCPElementSettingData/.libs/libcmpiDHCP_OpenDRIM_DHCPElementSettingDataProvider.so -Wl,-rpath -Wl,/usr/lib/cmpi
/usr/bin/ld: testOpenDRIM_DHCPElementSettingData-testOpenDRIM_DHCPElementSettingData.o: undefined reference to symbol 'Objectpath::toString() const'
/usr/bin/ld: note: 'Objectpath::toString() const' is defined in DSO /usr/lib/libopendrim.so.0 so try adding it to the linker command line
/usr/lib/libopendrim.so.0: could not read symbols: Invalid operation
collect2: ld returned 1 exit status
make[3]: *** [testOpenDRIM_DHCPElementSettingData] Error 1
make[3]: Leaving directory `/build/buildd/opendrim-lmp-dhcp-1.0.0/test'
make[2]: *** [all-recursive] Error 1
make[2]: Leaving directory `/build/buildd/opendrim-lmp-dhcp-1.0.0'
make[1]: *** [all] Error 2
make[1]: Leaving directory `/build/buildd/opendrim-lmp-dhcp-1.0.0'
make: *** [build-stamp] Error 2
dpkg-buildpackage: error: debian/rules build gave error exit status 2
******************************************************************************
Build finished at 20110408-1520
FAILED [dpkg-buildpackage died]
Purging chroot-autobuild/build/buildd/opendrim-lmp-dhcp-1.0.0

Related branches

Matthias Klose (doko) on 2011-04-10
Changed in opendrim-lmp-dhcp (Ubuntu):
importance: Undecided → High
tags: added: oneiric
Changed in opendrim-lmp-dhcp (Ubuntu):
milestone: none → oneiric-alpha-1
Changed in opendrim-lmp-dhcp (Ubuntu Oneiric):
milestone: oneiric-alpha-1 → oneiric-alpha-2
Changed in opendrim-lmp-dhcp (Ubuntu Oneiric):
assignee: nobody → Sebastian Carneiro (scarneiro)
status: New → In Progress
Changed in opendrim-lmp-dhcp (Ubuntu Oneiric):
milestone: oneiric-alpha-2 → none
tags: added: multiverse
Launchpad Janitor (janitor) wrote :

This bug was fixed in the package opendrim-lmp-dhcp - 1.0.0-0ubuntu2

---------------
opendrim-lmp-dhcp (1.0.0-0ubuntu2) oneiric; urgency=low

  * debian/patches/01-ftbfs-add-openldrim-lib.patch: Added library opendrim to
    LIBS variable in check routine of acinclude.m4 to build with ld
    --as-needed (LP: #756020)
 -- Sebastian Carneiro <email address hidden> Thu, 07 Jul 2011 10:59:39 +0200

Changed in opendrim-lmp-dhcp (Ubuntu Oneiric):
status: In Progress → Fix Released
To post a comment you must log in.
This report contains Public information  Edit
Everyone can see this information.

Other bug subscribers