opendrim-lmp-boot version 0.1.0-0ubuntu1 failed to build on i386

Bug #755942 reported by Matthias Klose on 2011-04-10
This bug affects 1 person
Affects Status Importance Assigned to Milestone
opendrim-lmp-boot (Ubuntu)

Bug Description

opendrim-lmp-boot version 0.1.0-0ubuntu1 failed to build on i386
Link to failed build:

Direct link to the build log:

This log snippet might be of interest, since it triggered the matcher 'Purging chroot-autobuild'.
Excerpt 1496 lines into the build log:

mv -f .deps/testOpenDRIM_BootConformsToProfile-testOpenDRIM_BootConformsToProfile.Tpo .deps/testOpenDRIM_BootConformsToProfile-testOpenDRIM_BootConformsToProfile.Po
/bin/bash ../libtool --tag=CXX --mode=link g++ -Wall -Wunused -fPIC -fno-rtti -fno-exceptions -O2 -g -O2 -Wl,-Bsymbolic-functions -L. -L/usr/lib/cmpi -L/usr/lib/cmpi -o testOpenDRIM_BootConformsToProfile testOpenDRIM_BootConformsToProfile-testOpenDRIM_BootConformsToProfile.o ../OpenDRIM_BootConformsToProfile/
libtool: link: g++ -Wall -Wunused -fPIC -fno-rtti -fno-exceptions -O2 -g -O2 -Wl,-Bsymbolic-functions -o .libs/testOpenDRIM_BootConformsToProfile testOpenDRIM_BootConformsToProfile-testOpenDRIM_BootConformsToProfile.o -L/build/buildd/opendrim-lmp-boot-0.1.0/test -L/usr/lib/cmpi ../OpenDRIM_BootConformsToProfile/.libs/ -Wl,-rpath -Wl,/usr/lib/cmpi
/usr/bin/ld: testOpenDRIM_BootConformsToProfile-testOpenDRIM_BootConformsToProfile.o: undefined reference to symbol 'Objectpath::toString() const'
/usr/bin/ld: note: 'Objectpath::toString() const' is defined in DSO /usr/lib/ so try adding it to the linker command line
/usr/lib/ could not read symbols: Invalid operation
collect2: ld returned 1 exit status
make[3]: *** [testOpenDRIM_BootConformsToProfile] Error 1
make[3]: Leaving directory `/build/buildd/opendrim-lmp-boot-0.1.0/test'
make[2]: *** [all-recursive] Error 1
make[2]: Leaving directory `/build/buildd/opendrim-lmp-boot-0.1.0'
make[1]: *** [all] Error 2
make[1]: Leaving directory `/build/buildd/opendrim-lmp-boot-0.1.0'
make: *** [build-stamp] Error 2
dpkg-buildpackage: error: debian/rules build gave error exit status 2
Build finished at 20110408-1530
FAILED [dpkg-buildpackage died]
Purging chroot-autobuild/build/buildd/opendrim-lmp-boot-0.1.0

Related branches

Matthias Klose (doko) on 2011-04-10
Changed in opendrim-lmp-boot (Ubuntu):
importance: Undecided → High
tags: added: oneiric
Changed in opendrim-lmp-boot (Ubuntu):
milestone: none → oneiric-alpha-1
Changed in opendrim-lmp-boot (Ubuntu Oneiric):
milestone: oneiric-alpha-1 → oneiric-alpha-2
Revision history for this message
Launchpad Janitor (janitor) wrote :

This bug was fixed in the package opendrim-lmp-boot - 0.1.0-0ubuntu2

opendrim-lmp-boot (0.1.0-0ubuntu2) oneiric; urgency=low

  * debian/patches/01-ftbfs-add-openldrim-lib.patch: Added library opendrim to
    LIBS variable in check routine of acinclude.m4 to build with ld
    --no-as-needed (LP: #755942)
 -- Sebastian Carneiro <email address hidden> Sun, 03 Jul 2011 17:40:44 -0300

Changed in opendrim-lmp-boot (Ubuntu Oneiric):
status: New → Fix Released
To post a comment you must log in.
This report contains Public information  Edit
Everyone can see this information.

Other bug subscribers