Ubuntu

Activity log for bug #683153

Date Who What changed Old value New value Message
2010-11-30 14:48:06 Michael MacDonald bug added bug
2011-07-05 02:58:43 Daniel van Vugt summary package nvidia-173 173.14.22-0ubuntu11 failed to install/upgrade: nvidia-173 kernel module failed to build package nvidia-173 173.14.22-0ubuntu11 failed to install/upgrade: nvidia-173 kernel module failed to build (pci_ids.h:1: internal compiler error: Segmentation fault)
2011-12-02 22:40:39 Bryce Harrington description install failed, rebooted and seemed to install properly. no issues since. ProblemType: Package DistroRelease: Ubuntu 10.04 Package: nvidia-173 173.14.22-0ubuntu11 ProcVersionSignature: Ubuntu 2.6.32-26.47-generic 2.6.32.24+drm33.11 Uname: Linux 2.6.32-26-generic i686 NonfreeKernelModules: nvidia Architecture: i386 CurrentDmesg: [ 20.721377] [drm] Initialized drm 1.1.0 20060810 [ 26.648019] eth0: no IPv6 routers present [ 29.130404] usblp0: nonzero read bulk status received: -71 [ 34.453874] ppdev: user-space parallel port driver [ 95.313626] ondemand governor failed, too long transition latency of HW, fallback to performance governor Date: Tue Nov 30 08:17:06 2010 DkmsStatus: nvidia-173, 173.14.22, 2.6.32-26-generic, i686: installed nvidia-173, 173.14.22, 2.6.32-24-generic, i686: installed nvidia-173, 173.14.22, 2.6.32-25-generic, i686: installed ErrorMessage: nvidia-173 kernel module failed to build InstallationMedia: Ubuntu 10.04 LTS "Lucid Lynx" - Release i386 (20100429) Lsusb: Bus 003 Device 001: ID 1d6b:0001 Linux Foundation 1.1 root hub Bus 002 Device 001: ID 1d6b:0001 Linux Foundation 1.1 root hub Bus 001 Device 003: ID 04f9:0042 Brother Industries, Ltd Bus 001 Device 002: ID 0424:a700 Standard Microsystems Corp. Bus 001 Device 001: ID 1d6b:0002 Linux Foundation 2.0 root hub MachineType: Ssystem manufacturer System product name PackageVersion: 173.14.22-0ubuntu11 ProcCmdLine: BOOT_IMAGE=/boot/vmlinuz-2.6.32-26-generic root=UUID=8807d8e9-2ca1-4035-9f0b-a346be9670b3 ro quiet splash SourcePackage: nvidia-graphics-drivers-173 Title: package nvidia-173 173.14.22-0ubuntu11 failed to install/upgrade: nvidia-173 kernel module failed to build dmi.bios.date: 08/06/2004 dmi.bios.vendor: American Megatrends Inc. dmi.bios.version: 3.00 dmi.board.name: A7NVM400 dmi.board.vendor: ASUSTeK Computer INC. dmi.board.version: Rev 2.xx dmi.chassis.asset.tag: Asset-1234567890 dmi.chassis.type: 3 dmi.chassis.vendor: Chassis Manufacture dmi.chassis.version: Chassis Version dmi.modalias: dmi:bvnAmericanMegatrendsInc.:bvr3.00:bd08/06/2004:svnSsystemmanufacturer:pnSystemproductname:pvrSystemversion:rvnASUSTeKComputerINC.:rnA7NVM400:rvrRev2.xx:cvnChassisManufacture:ct3:cvrChassisVersion: dmi.product.name: System product name dmi.product.version: System version dmi.sys.vendor: Ssystem manufacturer glxinfo: Error: [Errno 2] No such file or directory system: distro: Ubuntu codename: lucid architecture: i686 kernel: 2.6.32-26-generic install failed, rebooted and seemed to install properly. no issues since. include/linux/pci_ids.h:1: internal compiler error: Segmentation fault Please submit a full bug report, with preprocessed source if appropriate. See <file:///usr/share/doc/gcc-4.4/README.Bugs> for instructions. make[3]: *** [/var/lib/dkms/nvidia-173/173.14.22/build/nv-i2c.o] Error 1 make[2]: *** [_module_/var/lib/dkms/nvidia-173/173.14.22/build] Error 2 NVIDIA: left KBUILD. nvidia.ko failed to build! make[1]: *** [module] Error 1 make: *** [module] Error 2 ProblemType: Package DistroRelease: Ubuntu 10.04 Package: nvidia-173 173.14.22-0ubuntu11 ProcVersionSignature: Ubuntu 2.6.32-26.47-generic 2.6.32.24+drm33.11 Uname: Linux 2.6.32-26-generic i686 NonfreeKernelModules: nvidia Architecture: i386 CurrentDmesg:  [ 20.721377] [drm] Initialized drm 1.1.0 20060810  [ 26.648019] eth0: no IPv6 routers present  [ 29.130404] usblp0: nonzero read bulk status received: -71  [ 34.453874] ppdev: user-space parallel port driver  [ 95.313626] ondemand governor failed, too long transition latency of HW, fallback to performance governor Date: Tue Nov 30 08:17:06 2010 DkmsStatus:  nvidia-173, 173.14.22, 2.6.32-26-generic, i686: installed  nvidia-173, 173.14.22, 2.6.32-24-generic, i686: installed  nvidia-173, 173.14.22, 2.6.32-25-generic, i686: installed ErrorMessage: nvidia-173 kernel module failed to build InstallationMedia: Ubuntu 10.04 LTS "Lucid Lynx" - Release i386 (20100429) Lsusb:  Bus 003 Device 001: ID 1d6b:0001 Linux Foundation 1.1 root hub  Bus 002 Device 001: ID 1d6b:0001 Linux Foundation 1.1 root hub  Bus 001 Device 003: ID 04f9:0042 Brother Industries, Ltd  Bus 001 Device 002: ID 0424:a700 Standard Microsystems Corp.  Bus 001 Device 001: ID 1d6b:0002 Linux Foundation 2.0 root hub MachineType: Ssystem manufacturer System product name PackageVersion: 173.14.22-0ubuntu11 ProcCmdLine: BOOT_IMAGE=/boot/vmlinuz-2.6.32-26-generic root=UUID=8807d8e9-2ca1-4035-9f0b-a346be9670b3 ro quiet splash SourcePackage: nvidia-graphics-drivers-173 Title: package nvidia-173 173.14.22-0ubuntu11 failed to install/upgrade: nvidia-173 kernel module failed to build dmi.bios.date: 08/06/2004 dmi.bios.vendor: American Megatrends Inc. dmi.bios.version: 3.00 dmi.board.name: A7NVM400 dmi.board.vendor: ASUSTeK Computer INC. dmi.board.version: Rev 2.xx dmi.chassis.asset.tag: Asset-1234567890 dmi.chassis.type: 3 dmi.chassis.vendor: Chassis Manufacture dmi.chassis.version: Chassis Version dmi.modalias: dmi:bvnAmericanMegatrendsInc.:bvr3.00:bd08/06/2004:svnSsystemmanufacturer:pnSystemproductname:pvrSystemversion:rvnASUSTeKComputerINC.:rnA7NVM400:rvrRev2.xx:cvnChassisManufacture:ct3:cvrChassisVersion: dmi.product.name: System product name dmi.product.version: System version dmi.sys.vendor: Ssystem manufacturer glxinfo: Error: [Errno 2] No such file or directory system:  distro: Ubuntu  codename: lucid  architecture: i686  kernel: 2.6.32-26-generic
2011-12-02 22:40:53 Launchpad Janitor nvidia-graphics-drivers-173 (Ubuntu): status New Confirmed
2011-12-02 23:05:36 Bryce Harrington bug task added gcc-defaults (Ubuntu)
2011-12-02 23:05:52 Launchpad Janitor gcc-defaults (Ubuntu): status New Confirmed
2011-12-02 23:07:58 Bryce Harrington gcc-defaults (Ubuntu): importance Undecided High
2011-12-02 23:08:01 Bryce Harrington nvidia-graphics-drivers-173 (Ubuntu): importance Undecided High
2011-12-02 23:08:10 Bryce Harrington summary package nvidia-173 173.14.22-0ubuntu11 failed to install/upgrade: nvidia-173 kernel module failed to build (pci_ids.h:1: internal compiler error: Segmentation fault) package nvidia-173 173.14.22-0ubuntu11 failed to install/upgrade: nvidia-173 kernel module failed to build (pci_ids.h:1: internal compiler error: Segmentation fault) [Lucid]
2011-12-02 23:08:14 Bryce Harrington nvidia-graphics-drivers-173 (Ubuntu): status Confirmed Triaged
2012-05-06 18:16:28 Mario Balcázar Guerrero nvidia-graphics-drivers-173 (Ubuntu): status Triaged Fix Released