nagios-nrpe version 2.12-4ubuntu2 failed to build in oneiric

Bug #829434 reported by Matthias Klose
6
This bug affects 1 person
Affects Status Importance Assigned to Milestone
nagios-nrpe (Ubuntu)
High
Unassigned
Oneiric
High
Unassigned

Bug Description

nagios-nrpe version 2.12-4ubuntu2 failed to build in oneiric
Link to failed build: https://launchpad.net/ubuntu/+archive/test-rebuild-20110816/+build/2705964

Details about the rebuild:
http://people.ubuntuwire.org/~wgrant/rebuild-ftbfs-test/test-rebuild-20110816-oneiric.html

Direct link to the build log: https://launchpad.net/ubuntu/+archive/test-rebuild-20110816/+build/2705964/+files/buildlog_ubuntu-oneiric-i386.nagios-nrpe_2.12-4ubuntu2_FAILEDTOBUILD.txt.gz

This log snippet might be of interest, since it triggered the matcher 'Purging chroot-autobuild'.
Excerpt 663 lines into the build log:

checking for getopt_long... yes
checking for main in -lnsl... yes
checking for socket in -lsocket... no
checking for main in -lwrap... yes
checking for strdup... yes
checking for strstr... yes
checking for strtoul... yes
checking for initgroups... yes
checking for closesocket... no
checking for socklen_t... yes
checking for type of socket size... size_t
checking for SSL headers... SSL headers found in /usr
checking for SSL libraries... configure: error: Cannot find ssl libraries
make: *** [configure-stamp] Error 1
dpkg-buildpackage: error: debian/rules build gave error exit status 2
******************************************************************************
Build finished at 20110818-0307
FAILED [dpkg-buildpackage died]
Purging chroot-autobuild/build/buildd/nagios-nrpe-2.12

Matthias Klose (doko)
Changed in nagios-nrpe (Ubuntu):
milestone: none → ubuntu-11.10-beta-1
importance: Undecided → High
Matthias Klose (doko)
Changed in nagios-nrpe (Ubuntu Oneiric):
status: New → Confirmed
Matthias Klose (doko)
Changed in nagios-nrpe (Ubuntu):
status: Confirmed → Invalid
Matthias Klose (doko)
Changed in nagios-nrpe (Ubuntu Oneiric):
status: Invalid → Confirmed
Revision history for this message
Launchpad Janitor (janitor) wrote :

This bug was fixed in the package nagios-nrpe - 2.12-4ubuntu3

---------------
nagios-nrpe (2.12-4ubuntu3) oneiric; urgency=low

  * Configure with --with-ssl-lib=<multiarch dir>. LP: #829434.
 -- Matthias Klose <email address hidden> Thu, 25 Aug 2011 21:10:45 +0200

Changed in nagios-nrpe (Ubuntu Oneiric):
status: Confirmed → Fix Released
To post a comment you must log in.
This report contains Public information  Edit
Everyone can see this information.

Other bug subscribers