mooproxy version 0.1.3-1 failed to build on amd64 with GCC-4.6/oneiric

Bug #770784 reported by Matthias Klose on 2011-04-26
6
This bug affects 1 person
Affects Status Importance Assigned to Milestone
mooproxy (Debian)
New
Unknown
mooproxy (Ubuntu)
High
Unassigned
Oneiric
High
Unassigned

Bug Description

mooproxy version 0.1.3-1 failed to build on amd64 with GCC-4.6/oneiric
Link to failed build: https://launchpad.net/ubuntu/+archive/test-rebuild-20110413/+buildjob/2462415

Details about the rebuild:
https://lists.ubuntu.com/archives/ubuntu-devel/2011-April/033042.html

Direct link to the build log: https://launchpad.net/ubuntu/+archive/test-rebuild-20110413/+buildjob/2462415/+files/buildlog_ubuntu-natty-amd64.mooproxy_0.1.3-1_FAILEDTOBUILD.txt.gz

This log snippet might be of interest, since it triggered the matcher 'Purging chroot-autobuild'.
Excerpt 337 lines into the build log:

panic.c:98:8: warning: ignoring return value of 'write', declared with attribute warn_unused_result [-Wunused-result]
panic.c:106:7: warning: ignoring return value of 'write', declared with attribute warn_unused_result [-Wunused-result]
panic.c:107:7: warning: ignoring return value of 'write', declared with attribute warn_unused_result [-Wunused-result]
panic.c:112:8: warning: ignoring return value of 'write', declared with attribute warn_unused_result [-Wunused-result]
cc -Wall -g -O2 -c -o recall.o recall.c
cc -Wall -lcrypt mooproxy.o misc.o config.o daemon.o world.o network.o command.o mcp.o log.o accessor.o timer.o resolve.o crypt.o line.o panic.o recall.o -o mooproxy
crypt.o: In function `prompt_to_md5hash':
/build/buildd/mooproxy-0.1.3/crypt.c:85: undefined reference to `crypt'
crypt.o: In function `match_string_md5hash':
/build/buildd/mooproxy-0.1.3/crypt.c:216: undefined reference to `crypt'
collect2: ld returned 1 exit status
make[1]: *** [mooproxy] Error 1
make[1]: Leaving directory `/build/buildd/mooproxy-0.1.3'
make: *** [build-stamp] Error 2
dpkg-buildpackage: error: debian/rules build gave error exit status 2
******************************************************************************
Build finished at 20110424-1749
FAILED [dpkg-buildpackage died]
Purging chroot-autobuild/build/buildd/mooproxy-0.1.3

Related branches

Matthias Klose (doko) on 2011-04-26
Changed in mooproxy (Ubuntu):
importance: Undecided → High
Changed in mooproxy (Ubuntu):
milestone: none → oneiric-alpha-3
Julian Taylor (jtaylor) on 2011-06-29
Changed in mooproxy (Ubuntu Oneiric):
assignee: nobody → Julian Taylor (jtaylor)
status: New → In Progress
Julian Taylor (jtaylor) wrote :

patch available in debian bug

tags: added: patch-forwarded-debian
Changed in mooproxy (Ubuntu Oneiric):
milestone: oneiric-alpha-3 → none
tags: added: universe
Changed in mooproxy (Debian):
status: Unknown → New
Julian Taylor (jtaylor) on 2011-08-21
Changed in mooproxy (Ubuntu Oneiric):
assignee: Julian Taylor (jtaylor) → nobody
status: In Progress → Triaged
Launchpad Janitor (janitor) wrote :

This bug was fixed in the package mooproxy - 1.0.0-1ubuntu1

---------------
mooproxy (1.0.0-1ubuntu1) oneiric; urgency=low

  * change to source format 3.0 (quilt)
  * debian/patches/fix_as_needed_build.patch:
    - patch Makefile to fix build with ld --as-needed (LP: #770784)
 -- Julian Taylor <email address hidden> Mon, 22 Aug 2011 20:45:21 +0200

Changed in mooproxy (Ubuntu Oneiric):
status: Triaged → Fix Released
To post a comment you must log in.
This report contains Public information  Edit
Everyone can see this information.

Other bug subscribers

Remote bug watches

Bug watches keep track of this bug in other bug trackers.