mit-scheme version 9.0.1-1ubuntu1 failed to build on i386

Bug #756191 reported by Matthias Klose on 2011-04-10
6
This bug affects 1 person
Affects Status Importance Assigned to Milestone
mit-scheme (Ubuntu)
High
Unassigned
Oneiric
High
Unassigned

Bug Description

mit-scheme version 9.0.1-1ubuntu1 failed to build on i386
Link to failed build: https://launchpad.net/ubuntu/+archive/test-rebuild-20110329/+buildjob/2404429

Direct link to the build log: https://launchpad.net/ubuntu/+archive/test-rebuild-20110329/+buildjob/2404429/+files/buildlog_ubuntu-natty-i386.mit-scheme_9.0.1-1ubuntu1_FAILEDTOBUILD.txt.gz

This log snippet might be of interest, since it triggered the matcher 'Purging chroot-autobuild'.
Excerpt 1036 lines into the build log:

run_cmd: rm -f compiler/machine compiler/compiler.pkg
run_cmd: ln -s machines/i386 compiler/machine
run_cmd: ln -s machine/compiler.pkg compiler/.
run_cmd: mit-scheme-native --heap 4000
etc/create-makefiles.sh: 53: mit-scheme-native: not found
rm -f machine && ln -s machines/i386 machine
rm -f compiler.cbf && ln -s machine/compiler.cbf compiler.cbf
rm -f compiler.pkg && ln -s machine/compiler.pkg compiler.pkg
rm -f compiler.sf && ln -s machine/compiler.sf compiler.sf
rm -f make.com && ln -s machine/make.com make.com
configure: creating ./config.status
config.status: creating Makefile
config.status: error: cannot find input file: 6001/Makefile.in
make: *** [configure-stamp] Error 1
dpkg-buildpackage: error: debian/rules build gave error exit status 2
******************************************************************************
Build finished at 20110408-1619
FAILED [dpkg-buildpackage died]
Purging chroot-autobuild/build/buildd/mit-scheme-9.0.1

Related branches

Matthias Klose (doko) on 2011-04-10
Changed in mit-scheme (Ubuntu):
importance: Undecided → High
tags: added: oneiric
Changed in mit-scheme (Ubuntu):
milestone: none → oneiric-alpha-1
Changed in mit-scheme (Ubuntu Oneiric):
milestone: oneiric-alpha-1 → oneiric-alpha-2
Changed in mit-scheme (Ubuntu Oneiric):
milestone: oneiric-alpha-2 → none
status: New → Confirmed
tags: added: universe
Launchpad Janitor (janitor) wrote :

This bug was fixed in the package mit-scheme - 9.0.1-1ubuntu2

---------------
mit-scheme (9.0.1-1ubuntu2) oneiric; urgency=low

  * Rebuild for openssl0.9.8 -> openssl1.0.0 transition.
  * Drop bootstrapping changes made in previous upload (LP: #756191).
 -- Ilya Barygin <email address hidden> Sun, 21 Aug 2011 16:11:49 +0400

Changed in mit-scheme (Ubuntu Oneiric):
status: Confirmed → Fix Released
To post a comment you must log in.
This report contains Public information  Edit
Everyone can see this information.

Other bug subscribers