loop-aes module does not compile

Bug #362396 reported by Chris Osgood on 2009-04-16
10
This bug affects 1 person
Affects Status Importance Assigned to Milestone
loop-aes-source (Ubuntu)
Undecided
Unassigned

Bug Description

Binary package hint: loop-aes-source

Using module assistant to built loop-aes-source (3.2c) kernel module fails:

make[3]: Entering directory `/usr/src/linux-headers-2.6.28-11-generic'
 CC [M] /usr/src/modules/loop-aes/tmp-d-kbuild/patched-loop.o
 /usr/src/modules/loop-aes/tmp-d-kbuild/patched-loop.c: In function ‘loop_get_buffer’:
 /usr/src/modules/loop-aes/tmp-d-kbuild/patched-loop.c:587: error:
 ‘struct bio’ has no member named ‘bi_hw_front_size’
 /usr/src/modules/loop-aes/tmp-d-kbuild/patched-loop.c:597: error:
 ‘struct bio’ has no member named ‘bi_hw_front_size’
 /usr/src/modules/loop-aes/tmp-d-kbuild/patched-loop.c:609: error:
 ‘struct bio’ has no member named ‘bi_hw_segments’
 /usr/src/modules/loop-aes/tmp-d-kbuild/patched-loop.c:612: error:
 ‘struct bio’ has no member named ‘bi_hw_front_size’
 /usr/src/modules/loop-aes/tmp-d-kbuild/patched-loop.c:613: error:
 ‘struct bio’ has no member named ‘bi_hw_back_size’
 /usr/src/modules/loop-aes/tmp-d-kbuild/patched-loop.c: In function ‘loop_make_request_real’:
 /usr/src/modules/loop-aes/tmp-d-kbuild/patched-loop.c:906: error:
 ‘struct bio’ has no member named ‘bi_hw_front_size’
 /usr/src/modules/loop-aes/tmp-d-kbuild/patched-loop.c:911: error:
 ‘struct bio’ has no member named ‘bi_hw_front_size’
 /usr/src/modules/loop-aes/tmp-d-kbuild/patched-loop.c: At top level:
 /usr/src/modules/loop-aes/tmp-d-kbuild/patched-loop.c:1994: warning:
 initialization from incompatible pointer type
 /usr/src/modules/loop-aes/tmp-d-kbuild/patched-loop.c:1995: warning:
 initialization from incompatible pointer type
 /usr/src/modules/loop-aes/tmp-d-kbuild/patched-loop.c:1996: warning:
 initialization from incompatible pointer type
 /usr/src/modules/loop-aes/tmp-d-kbuild/patched-loop.c:1998: warning:
 initialization from incompatible pointer type
 make[4]: *** [/usr/src/modules/loop-aes/tmp-d-kbuild/patched-loop.o]
 Error 1
 make[3]: *** [_module_/usr/src/modules/loop-aes/tmp-d-kbuild] Error 2
 make[3]: Leaving directory `/usr/src/linux-headers-2.6.28-11-generic'
 make[2]: *** [all] Error 2
 make[2]: Leaving directory `/usr/src/modules/loop-aes'
 make[1]: *** [build-stamp] Error 2
 make[1]: Leaving directory `/usr/src/modules/loop-aes'
 make: *** [kdist_build] Error 2

ProblemType: Bug
Architecture: amd64
DistroRelease: Ubuntu 9.04
NonfreeKernelModules: nvidia
Package: loop-aes-source 3.2c-2
PackageArchitecture: all
ProcEnviron:
 PATH=(custom, user)
 LANG=en_US.UTF-8
 SHELL=/bin/bash
SourcePackage: loop-aes
Uname: Linux 2.6.28-11-generic x86_64

To post a comment you must log in.
This report contains Public information  Edit
Everyone can see this information.

Other bug subscribers