[powerpc] ftbfs (ql4_nx.c:788:3: error: implicit declaration of function)

Bug #733805 reported by Matthias Klose on 2011-03-12
6
This bug affects 1 person
Affects Status Importance Assigned to Milestone
linux (Ubuntu)
Medium
Unassigned
Natty
Medium
Unassigned

Bug Description

2.6.38-6.34

no verbose build logs available

  CC [M] drivers/scsi/qla4xxx/ql4_nx.o
  CC [M] drivers/net/tulip/pnic.o
/build/buildd/linux-2.6.38/drivers/scsi/qla4xxx/ql4_nx.c: In function 'qla4_8xxx_pci_mem_read_direct':
/build/buildd/linux-2.6.38/drivers/scsi/qla4xxx/ql4_nx.c:717:3: error: implicit declaration of function 'readq'
/build/buildd/linux-2.6.38/drivers/scsi/qla4xxx/ql4_nx.c: In function 'qla4_8xxx_pci_mem_write_direct':
/build/buildd/linux-2.6.38/drivers/scsi/qla4xxx/ql4_nx.c:788:3: error: implicit declaration of function 'writeq'
make[5]: *** [drivers/scsi/qla4xxx/ql4_nx.o] Error 1
make[4]: *** [drivers/scsi/qla4xxx] Error 2
make[3]: *** [drivers/scsi] Error 2

Matthias Klose (doko) on 2011-03-12
Changed in linux (Ubuntu Natty):
milestone: none → ubuntu-11.04-beta-1
Jeremy Foshee (jeremyfoshee) wrote :

Hi Matthias,

Please be sure to confirm this issue exists with the latest development release of Ubuntu. ISO CD images are available from http://cdimage.ubuntu.com/daily/current/ . If the issue remains, please run the following command from a Terminal (Applications->Accessories->Terminal). It will automatically gather and attach updated debug information to this report.

apport-collect -p linux 733805

Also, if you could test the latest upstream kernel available that would be great. It will allow additional upstream developers to examine the issue. Refer to https://wiki.ubuntu.com/KernelMainlineBuilds . Once you've tested the upstream kernel, please remove the 'needs-upstream-testing' tag. This can be done by clicking on the yellow pencil icon next to the tag located at the bottom of the bug description and deleting the 'needs-upstream-testing' text. Please let us know your results.

Thanks in advance.

    [This is an automated message. Apologies if it has reached you inappropriately; please just reply to this message indicating so.]

tags: added: needs-kernel-logs
tags: added: needs-upstream-testing
tags: added: kj-triage
Matthias Klose (doko) wrote :

please ask for a dist-upgrade of the powerpc test machine (davis), and recheck if the kernel builds.

Lee Jones (lag) wrote :

If this is still an issue, can you post the config you're using?

Changed in linux (Ubuntu Natty):
milestone: ubuntu-11.04-beta-1 → none
Changed in linux (Ubuntu Natty):
importance: Undecided → Medium
Jeremy Foshee (jeremyfoshee) wrote :

Fix Releasing as this seems to have been fixed.

~JFO

Changed in linux (Ubuntu Natty):
status: New → Fix Released
To post a comment you must log in.
This report contains Public information  Edit
Everyone can see this information.

Other bug subscribers