libpam-encfs version 0.1.4.4-3 failed to build on i386

Bug #803183 reported by Stefano Rivera on 2011-06-28
6
This bug affects 1 person
Affects Status Importance Assigned to Milestone
libpam-encfs (Debian)
Fix Released
Unknown
libpam-encfs (Ubuntu)
Medium
David Shorten

Bug Description

libpam-encfs version 0.1.4.4-3 failed to build on i386
Link to failed build: https://launchpad.net/ubuntu/+source/libpam-encfs/0.1.4.4-3/+build/2468566

Direct link to the build log: https://launchpad.net/ubuntu/+source/libpam-encfs/0.1.4.4-3/+build/2468566/+files/buildlog_ubuntu-oneiric-i386.libpam-encfs_0.1.4.4-3_FAILEDTOBUILD.txt.gz

This log snippet might be of interest, since it triggered the matcher 'Purging chroot-autobuild'.
Excerpt 488 lines into the build log:

pam_encfs.c: In function 'pam_sm_authenticate':
pam_encfs.c:585:18: warning: ignoring return value of 'chdir', declared with attribute warn_unused_result [-Wunused-result]
ld --shared -x -lc -o pam_encfs.so pam_encfs.o -lpam
pam_encfs.o: In function `readconfig':
/build/buildd/libpam-encfs-0.1.4.4/pam_encfs.c:410: undefined reference to `__stack_chk_fail_local'
pam_encfs.o: In function `pam_sm_authenticate':
/build/buildd/libpam-encfs-0.1.4.4/pam_encfs.c:636: undefined reference to `__stack_chk_fail_local'
pam_encfs.o: In function `pam_sm_close_session':
/build/buildd/libpam-encfs-0.1.4.4/pam_encfs.c:707: undefined reference to `__stack_chk_fail_local'
ld: pam_encfs.so: hidden symbol `__stack_chk_fail_local' isn't defined
ld: final link failed: Bad value
make[1]: *** [pam_encfs.so] Error 1
make[1]: Leaving directory `/build/buildd/libpam-encfs-0.1.4.4'
make: *** [build-stamp] Error 2
dpkg-buildpackage: error: debian/rules build gave error exit status 2
******************************************************************************
Build finished at 20110501-2128
FAILED [dpkg-buildpackage died]
Purging chroot-autobuild/build/buildd/libpam-encfs-0.1.4.4

Related branches

Changed in libpam-encfs (Ubuntu):
importance: Undecided → Medium
Changed in libpam-encfs (Ubuntu):
assignee: nobody → David Shorten (dpshorten)
Launchpad Janitor (janitor) wrote :

This bug was fixed in the package libpam-encfs - 0.1.4.4-3ubuntu1

---------------
libpam-encfs (0.1.4.4-3ubuntu1) oneiric; urgency=low

  * Changed debian/rules so that the package built with the
    ld option --as-needed enabled. (LP: #803183)
 -- David Shorten <email address hidden> Sun, 10 Jul 2011 13:10:02 +0200

Changed in libpam-encfs (Ubuntu):
status: New → Fix Released
Changed in libpam-encfs (Debian):
status: Unknown → Fix Released
To post a comment you must log in.
This report contains Public information  Edit
Everyone can see this information.

Other bug subscribers

Remote bug watches

Bug watches keep track of this bug in other bug trackers.