libgrapple version 0.9.1-0ubuntu2 failed to build on i386

Bug #749158 reported by Matthias Klose on 2011-04-03
6
This bug affects 1 person
Affects Status Importance Assigned to Milestone
libgrapple (Ubuntu)
High
Unassigned
Oneiric
High
Unassigned

Bug Description

libgrapple version 0.9.1-0ubuntu2 failed to build on i386
Link to failed build: https://launchpad.net/ubuntu/+archive/test-rebuild-20110329/+buildjob/2400252

Direct link to the build log: https://launchpad.net/ubuntu/+archive/test-rebuild-20110329/+buildjob/2400252/+files/buildlog_ubuntu-natty-i386.libgrapple_0.9.1-0ubuntu2_FAILEDTOBUILD.txt.gz

This log snippet might be of interest, since it triggered the matcher 'Purging chroot-autobuild'.
Excerpt 944 lines into the build log:

../libtool: line 1103: X-DHAVE_STDINT_H=1: command not found
../libtool: line 1103: X-DHAVE_UNISTD_H=1: command not found
../libtool: line 1103: X-DHAVE_DLFCN_H=1: command not found
../libtool: line 1103: X-DLT_OBJDIR=".libs/": No such file or directory
../libtool: line 1103: X-I.: command not found
../libtool: line 1103: X-I.: command not found
../libtool: line 1103: X-Wall: command not found
../libtool: line 1103: X-g: command not found
../libtool: line 1103: X-O2: command not found
../libtool: line 1103: X-pthread: command not found
../libtool: line 1103: X-MT: command not found
../libtool: line 1103: Xdynstring.lo: command not found
../libtool: line 1103: X-MD: command not found
../libtool: line 1103: X-MP: command not found
../libtool: line 1103: X-MF: command not found
../libtool: line 1103: X.deps/dynstring.Tpo: No such file or directory
../libtool: line 1103: X-c: command not found
../libtool: line 1154: Xdynstring.lo: command not found
../libtool: line 1159: libtool: compile: cannot determine name of library object from `': command not found
make[2]: *** [dynstring.lo] Error 1
make[2]: Leaving directory `/build/buildd/libgrapple-0.9.1/src'
make[1]: *** [check-recursive] Error 1
make[1]: Leaving directory `/build/buildd/libgrapple-0.9.1'
make: *** [build-stamp] Error 2
dpkg-buildpackage: error: debian/rules build gave error exit status 2
******************************************************************************
Build finished at 20110403-0902
FAILED [dpkg-buildpackage died]
Purging chroot-autobuild/build/buildd/libgrapple-0.9.1

Related branches

tags: added: oneiric
Changed in libgrapple (Ubuntu):
milestone: none → oneiric-alpha-1
Changed in libgrapple (Ubuntu Oneiric):
milestone: oneiric-alpha-1 → oneiric-alpha-2
Changed in libgrapple (Ubuntu Oneiric):
milestone: oneiric-alpha-2 → none
status: New → Confirmed
tags: added: universe
Matthias Klose (doko) on 2011-09-08
Changed in libgrapple (Ubuntu Oneiric):
importance: Undecided → High
Launchpad Janitor (janitor) wrote :

This bug was fixed in the package libgrapple - 0.9.1-0ubuntu3

---------------
libgrapple (0.9.1-0ubuntu3) oneiric; urgency=low

  * Use dh-autoreconf so that libtool is properly rebuilt (LP: #749158).
  * Use ${binary:Version} substvar rather than deprecated ${Source-Version}.
  * Add ${misc:Depends}.
 -- Colin Watson <email address hidden> Sat, 10 Sep 2011 00:56:02 +0100

Changed in libgrapple (Ubuntu Oneiric):
status: Confirmed → Fix Released
To post a comment you must log in.
This report contains Public information  Edit
Everyone can see this information.

Other bug subscribers