libgnome2-gconf-perl version 1.044-3build1 failed to build in oneiric

Bug #831274 reported by Matthias Klose on 2011-08-22
This bug affects 4 people
Affects Status Importance Assigned to Milestone
libgnome2-gconf-perl (Ubuntu)

Bug Description

libgnome2-gconf-perl version 1.044-3build1 failed to build in oneiric
Link to failed build:

Details about the rebuild:

Direct link to the build log:

This log snippet might be of interest, since it triggered the matcher 'Purging chroot-autobuild'.
Excerpt 476 lines into the build log:

Test Summary Report
t/00.GConf.t (Wstat: 512 Tests: 0 Failed: 0)
  Non-zero exit status: 2
  Parse errors: No plan found in TAP output
Files=1, Tests=0, 0 wallclock secs ( 0.02 usr 0.01 sys + 0.02 cusr 0.01 csys = 0.06 CPU)
Result: FAIL
Failed 1/1 test programs. 0/0 subtests failed.
make[2]: *** [test_dynamic] Error 2
make[2]: Leaving directory `/build/buildd/libgnome2-gconf-perl-1.044'
dh_auto_test: make -j1 test returned exit code 2
make[1]: *** [override_dh_auto_test] Error 29
make[1]: Leaving directory `/build/buildd/libgnome2-gconf-perl-1.044'
make: *** [build-stamp] Error 2
dpkg-buildpackage: error: debian/rules build gave error exit status 2
Build finished at 20110821-2002
FAILED [dpkg-buildpackage died]
Purging chroot-autobuild/build/buildd/libgnome2-gconf-perl-1.044

Matthias Klose (doko) on 2011-08-22
Changed in libgnome2-gconf-perl (Ubuntu):
status: New → Confirmed
importance: Undecided → High
Matthias Klose (doko) wrote :

not seen in unstable

Rolf Leggewie (r0lf) wrote :

oneiric has seen the end of its life and is no longer receiving any updates. Marking the oneiric task for this ticket as "Won't Fix".

Changed in libgnome2-gconf-perl (Ubuntu Oneiric):
status: Confirmed → Won't Fix
To post a comment you must log in.
This report contains Public information  Edit
Everyone can see this information.

Other bug subscribers