libaio version 0.3.109-1ubuntu1 failed to build in oneiric

Bug #829465 reported by Matthias Klose on 2011-08-19
6
This bug affects 1 person
Affects Status Importance Assigned to Milestone
libaio (Debian)
Fix Released
Unknown
libaio (Ubuntu)
High
Colin Watson
Oneiric
High
Colin Watson

Bug Description

libaio version 0.3.109-1ubuntu1 failed to build in oneiric
Link to failed build: https://launchpad.net/ubuntu/+archive/test-rebuild-20110816/+build/2699110

Details about the rebuild:
http://people.ubuntuwire.org/~wgrant/rebuild-ftbfs-test/test-rebuild-20110816-oneiric.html

Direct link to the build log: https://launchpad.net/ubuntu/+archive/test-rebuild-20110816/+build/2699110/+files/buildlog_ubuntu-oneiric-i386.libaio_0.3.109-1ubuntu1_FAILEDTOBUILD.txt.gz

This log snippet might be of interest, since it triggered the matcher 'Purging chroot-autobuild'.
Excerpt 568 lines into the build log:

cc -Wall -Werror -I../src -g -O -DTEST_NAME=\"cases/6.t\" -o cases/6.p main.c ../src/libaio.a
cc -Wall -Werror -I../src -g -O -DTEST_NAME=\"cases/7.t\" -o cases/7.p main.c ../src/libaio.a
cc -Wall -Werror -I../src -g -O -DTEST_NAME=\"cases/11.t\" -o cases/11.p main.c ../src/libaio.a
cc -Wall -Werror -I../src -g -O -DTEST_NAME=\"cases/12.t\" -o cases/12.p main.c ../src/libaio.a
In file included from main.c:34:0:
cases/12.t: In function 'test_main':
cases/12.t:21:6: error: variable 'res' set but not used [-Werror=unused-but-set-variable]
cc1: all warnings being treated as errors

make[2]: *** [cases/12.p] Error 1
make[2]: Leaving directory `/build/buildd/libaio-0.3.109/harness'
make[1]: *** [partcheck] Error 2
make[1]: Leaving directory `/build/buildd/libaio-0.3.109'
make: *** [check-arch] Error 2
dpkg-buildpackage: error: /usr/bin/fakeroot debian/rules binary gave error exit status 2
******************************************************************************
Build finished at 20110817-1250
FAILED [dpkg-buildpackage died]
Purging chroot-autobuild/build/buildd/libaio-0.3.109

Related branches

Matthias Klose (doko) on 2011-08-19
Changed in libaio (Ubuntu):
milestone: none → ubuntu-11.10-beta-1
Matthias Klose (doko) on 2011-08-19
Changed in libaio (Ubuntu):
status: New → Invalid
Matthias Klose (doko) on 2011-08-19
Changed in libaio (Ubuntu Oneiric):
importance: Undecided → High
status: Invalid → Confirmed
Colin Watson (cjwatson) on 2011-08-22
Changed in libaio (Ubuntu Oneiric):
assignee: nobody → Colin Watson (cjwatson)
Launchpad Janitor (janitor) wrote :

This bug was fixed in the package libaio - 0.3.109-1ubuntu2

---------------
libaio (0.3.109-1ubuntu2) oneiric; urgency=low

  * Fix unused variable causing build failure with GCC 4.6 (LP: #829465).
 -- Colin Watson <email address hidden> Mon, 22 Aug 2011 13:58:07 +0100

Changed in libaio (Ubuntu Oneiric):
status: Confirmed → Fix Released
Changed in libaio (Debian):
status: Unknown → New
Changed in libaio (Debian):
status: New → Fix Released
To post a comment you must log in.
This report contains Public information  Edit
Everyone can see this information.

Other bug subscribers

Remote bug watches

Bug watches keep track of this bug in other bug trackers.