leveldb version 0+20120125.git3c8be10-1 failed to build on armhf

Bug #945389 reported by Ricardo Salveti on 2012-03-03
6
This bug affects 1 person
Affects Status Importance Assigned to Milestone
leveldb (Ubuntu)
High
Unassigned

Bug Description

leveldb version 0+20120125.git3c8be10-1 failed to build on armhf
Link to failed build: https://launchpad.net/ubuntu/+source/leveldb/0+20120125.git3c8be10-1/+build/3186444

Direct link to the build log: https://launchpad.net/ubuntu/+source/leveldb/0+20120125.git3c8be10-1/+build/3186444/+files/buildlog_ubuntu-precise-armhf.leveldb_0%2B20120125.git3c8be10-1_FAILEDTOBUILD.txt.gz

This log snippet might be of interest, since it triggered the matcher 'Purging chroot-autobuild'.
Excerpt 326 lines into the build log:

expected=5000..9999; got=8062; bad_keys=0; bad_values=0; missed=0
==== Test CorruptionTest.MissingDescriptor
expected=1000..1000; got=1000; bad_keys=0; bad_values=0; missed=0
==== Test CorruptionTest.SequenceNumberRecovery
==== Test CorruptionTest.CorruptedDescriptor
==== Test CorruptionTest.CompactionInputError
expected=9..9; got=9; bad_keys=0; bad_values=1; missed=0
expected=10000..10000; got=10000; bad_keys=0; bad_values=0; missed=0
==== Test CorruptionTest.CompactionInputErrorParanoid
db/corruption_test.cc:325: failed: 1 == 5
make[1]: *** [check] Error 1
make[1]: Leaving directory `/build/buildd/leveldb-0+20120125.git3c8be10'
dh_auto_test: make -j1 check returned exit code 2
make: *** [build] Error 29
dpkg-buildpackage: error: debian/rules build gave error exit status 2
******************************************************************************
Build finished at 20120204-1908
FAILED [dpkg-buildpackage died]
Purging chroot-autobuild/build/buildd/leveldb-0+20120125.git3c8be10

Changed in leveldb (Ubuntu):
status: New → Confirmed
importance: Undecided → High
Jani Monoses (jani) on 2012-03-09
Changed in leveldb (Ubuntu):
status: Confirmed → Fix Released
Martin Pitt (pitti) wrote :
Changed in leveldb (Ubuntu):
status: Fix Released → Triaged
Martin Pitt (pitti) wrote :
Martin Pitt (pitti) wrote :

A retry on 1.10.0-1git1 worked, so this sounds like a race condition. We still have https://launchpad.net/ubuntu/+source/leveldb/1.10.0-1/+build/4616412 as an example of a failed one.

To post a comment you must log in.
This report contains Public information  Edit
Everyone can see this information.

Other bug subscribers

Remote bug watches

Bug watches keep track of this bug in other bug trackers.