kx11grab version 0.1.12-0ubuntu2 failed to build in oneiric

Bug #831105 reported by Matthias Klose on 2011-08-22
10
This bug affects 1 person
Affects Status Importance Assigned to Milestone
kx11grab (Ubuntu)
High
Unassigned
Oneiric
High
Unassigned

Bug Description

kx11grab version 0.1.12-0ubuntu2 failed to build in oneiric
Link to failed build: https://launchpad.net/ubuntu/+archive/test-rebuild-20110816/+build/2698026

Details about the rebuild:
http://people.ubuntuwire.org/~wgrant/rebuild-ftbfs-test/test-rebuild-20110816-oneiric.html

Direct link to the build log: https://launchpad.net/ubuntu/+archive/test-rebuild-20110816/+build/2698026/+files/buildlog_ubuntu-oneiric-amd64.kx11grab_0.1.12-0ubuntu2_FAILEDTOBUILD.txt.gz

This log snippet might be of interest, since it triggered the matcher 'Purging chroot-autobuild'.
Excerpt 1146 lines into the build log:

cd /build/buildd/kx11grab-0.1.12/obj-x86_64-linux-gnu/src && /usr/bin/c++ -D_BSD_SOURCE -D_XOPEN_SOURCE=500 -D_BSD_SOURCE -DQT_NO_STL -DQT_NO_CAST_TO_ASCII -D_REENTRANT -DKDE_DEPRECATED_WARNINGS -DKDE4_CMAKE_TOPLEVEL_DIR_LENGTH=13 -g -O2 -Wnon-virtual-dtor -Wno-long-long -ansi -Wundef -Wcast-align -Wchar-subscripts -Wall -W -Wpointer-arith -Wformat-security -fno-exceptions -DQT_NO_EXCEPTIONS -fno-check-new -fno-common -Woverloaded-virtual -fno-threadsafe-statics -fvisibility=hidden -Werror=return-type -fvisibility-inlines-hidden -O2 -g -DNDEBUG -DQT_NO_DEBUG -I/build/buildd/kx11grab-0.1.12/obj-x86_64-linux-gnu/src -I/build/buildd/kx11grab-0.1.12/src -I/build/buildd/kx11grab-0.1.12/src/kx11grab -I/build/buildd/kx11grab-0.1.12/obj-x86_64-linux-gnu -I/usr/include/KDE -I/usr/include/qt4/phonon -I/usr/include/qt4/QtXmlPatterns -I/usr/include/qt4/QtXml -I/usr/include/qt4/QtUiTools -I/usr/include/qt4/QtTest -I/usr/include/qt4/QtSvg -I/usr/include/qt4/QtSql -I/usr/include/qt4/QtScriptTools -I/usr/include/qt4/QtScript -I/usr/include/qt4/QtNetwork -I/usr/include/qt4/QtHelp -I/usr/include/qt4/QtDesigner -I/usr/include/qt4/QtDeclarative -I/usr/include/qt4/QtDBus -I/usr/include/qt4/Qt3Support -I/usr/include/qt4/QtGui -I/usr/include/qt4/QtCore -I/usr/include/qt4/Qt -I/usr/share/qt4/mkspecs/default -I/usr/include/qt4 -D_GNU_SOURCE -D_LARGEFILE64_SOURCE -o CMakeFiles/kx11grab.dir/desktopinfo.o -c /build/buildd/kx11grab-0.1.12/src/desktopinfo.cpp
/usr/bin/cmake -E cmake_progress_report /build/buildd/kx11grab-0.1.12/obj-x86_64-linux-gnu/CMakeFiles 8
[ 64%] Building CXX object src/CMakeFiles/kx11grab.dir/windowgrabber.o
cd /build/buildd/kx11grab-0.1.12/obj-x86_64-linux-gnu/src && /usr/bin/c++ -D_BSD_SOURCE -D_XOPEN_SOURCE=500 -D_BSD_SOURCE -DQT_NO_STL -DQT_NO_CAST_TO_ASCII -D_REENTRANT -DKDE_DEPRECATED_WARNINGS -DKDE4_CMAKE_TOPLEVEL_DIR_LENGTH=13 -g -O2 -Wnon-virtual-dtor -Wno-long-long -ansi -Wundef -Wcast-align -Wchar-subscripts -Wall -W -Wpointer-arith -Wformat-security -fno-exceptions -DQT_NO_EXCEPTIONS -fno-check-new -fno-common -Woverloaded-virtual -fno-threadsafe-statics -fvisibility=hidden -Werror=return-type -fvisibility-inlines-hidden -O2 -g -DNDEBUG -DQT_NO_DEBUG -I/build/buildd/kx11grab-0.1.12/obj-x86_64-linux-gnu/src -I/build/buildd/kx11grab-0.1.12/src -I/build/buildd/kx11grab-0.1.12/src/kx11grab -I/build/buildd/kx11grab-0.1.12/obj-x86_64-linux-gnu -I/usr/include/KDE -I/usr/include/qt4/phonon -I/usr/include/qt4/QtXmlPatterns -I/usr/include/qt4/QtXml -I/usr/include/qt4/QtUiTools -I/usr/include/qt4/QtTest -I/usr/include/qt4/QtSvg -I/usr/include/qt4/QtSql -I/usr/include/qt4/QtScriptTools -I/usr/include/qt4/QtScript -I/usr/include/qt4/QtNetwork -I/usr/include/qt4/QtHelp -I/usr/include/qt4/QtDesigner -I/usr/include/qt4/QtDeclarative -I/usr/include/qt4/QtDBus -I/usr/include/qt4/Qt3Support -I/usr/include/qt4/QtGui -I/usr/include/qt4/QtCore -I/usr/include/qt4/Qt -I/usr/share/qt4/mkspecs/default -I/usr/include/qt4 -D_GNU_SOURCE -D_LARGEFILE64_SOURCE -o CMakeFiles/kx11grab.dir/windowgrabber.o -c /build/buildd/kx11grab-0.1.12/src/windowgrabber.cpp
/build/buildd/kx11grab-0.1.12/src/windowgrabber.cpp:15:22: fatal error: X11/Xlib.h: No such file or directory
compilation terminated.
make[3]: *** [src/CMakeFiles/kx11grab.dir/windowgrabber.o] Error 1
make[3]: Leaving directory `/build/buildd/kx11grab-0.1.12/obj-x86_64-linux-gnu'
make[2]: *** [src/CMakeFiles/kx11grab.dir/all] Error 2
make[2]: Leaving directory `/build/buildd/kx11grab-0.1.12/obj-x86_64-linux-gnu'
make[1]: *** [all] Error 2
make[1]: Leaving directory `/build/buildd/kx11grab-0.1.12/obj-x86_64-linux-gnu'
dh_auto_build: make -j1 returned exit code 2
make: *** [build] Error 2
dpkg-buildpackage: error: debian/rules build gave error exit status 2
******************************************************************************
Build finished at 20110821-1405
FAILED [dpkg-buildpackage died]
Purging chroot-autobuild/build/buildd/kx11grab-0.1.12

Related branches

Matthias Klose (doko) on 2011-08-22
Changed in kx11grab (Ubuntu):
status: New → Confirmed
importance: Undecided → High
Kyle Williams (dappermuis) wrote :

Fixed: Adds missing build dependency for libx11-dev

Launchpad Janitor (janitor) wrote :

This bug was fixed in the package kx11grab - 0.1.12-0ubuntu3

---------------
kx11grab (0.1.12-0ubuntu3) oneiric; urgency=low

  [ Kyle Williams ]
  * Add missing build dependency on libx11-dev. LP: #831105

  [ Stefano Rivera ]
  * Bumped Standards-Version to 3.9.2, no changes needed.
  * wrap-and-sort debian/control.
  * Rephrase package description to please lintian.
  * Tweak wording in debian/copyright.
  * Depend on ffmpeg.
 -- Kyle Williams <email address hidden> Sun, 04 Sep 2011 00:57:56 +0200

Changed in kx11grab (Ubuntu Oneiric):
status: Confirmed → Fix Released
To post a comment you must log in.
This report contains Public information  Edit
Everyone can see this information.

Other bug subscribers