Comment 55 for bug 280997

Tried compiling it this morning for intrepid + kde 4.2rc1 and came up with
this:

[ 3%] Building CXX object src/CMakeFiles/kbluetooth4.dir/agent/agent.o
/home/srelysian/kbluetooth4/src/agent/agent.cpp: In member function 'void
Agent::Authorize(QDBusObjectPath, const QString&)':
/home/srelysian/kbluetooth4/src/agent/agent.cpp:75: error: 'class
Solid::Control::BluetoothInterface' has no member named
'findBluetoothRemoteDeviceUBI'
/home/srelysian/kbluetooth4/src/agent/agent.cpp:76: error: 'class
Solid::Control::BluetoothRemoteDevice' has no member named 'name'
/home/srelysian/kbluetooth4/src/agent/agent.cpp:77: error: 'class
Solid::Control::BluetoothRemoteDevice' has no member named 'address'
/home/srelysian/kbluetooth4/src/agent/agent.cpp:84: error: 'class
Solid::Control::BluetoothRemoteDevice' has no member named 'setTrusted'
/home/srelysian/kbluetooth4/src/agent/agent.cpp:85: error: 'class
Solid::Control::BluetoothRemoteDevice' has no member named 'name'
/home/srelysian/kbluetooth4/src/agent/agent.cpp: In member function 'QString
Agent::RequestPinCode(QDBusObjectPath)':
/home/srelysian/kbluetooth4/src/agent/agent.cpp:105: error: 'class
Solid::Control::BluetoothInterface' has no member named
'findBluetoothRemoteDeviceUBI'
/home/srelysian/kbluetooth4/src/agent/agent.cpp:107: error: 'class
Solid::Control::BluetoothRemoteDevice' has no member named 'name'
/home/srelysian/kbluetooth4/src/agent/agent.cpp:108: error: 'class
Solid::Control::BluetoothRemoteDevice' has no member named 'address'
/home/srelysian/kbluetooth4/src/agent/agent.cpp: In member function 'quint32
Agent::RequestPasskey(QDBusObjectPath)':
/home/srelysian/kbluetooth4/src/agent/agent.cpp:125: error: 'class
Solid::Control::BluetoothInterface' has no member named
'findBluetoothRemoteDeviceUBI'
/home/srelysian/kbluetooth4/src/agent/agent.cpp:127: error: 'class
Solid::Control::BluetoothRemoteDevice' has no member named 'name'
/home/srelysian/kbluetooth4/src/agent/agent.cpp:128: error: 'class
Solid::Control::BluetoothRemoteDevice' has no member named 'address'
make[2]: *** [src/CMakeFiles/kbluetooth4.dir/agent/agent.o] Error 1
make[1]: *** [src/CMakeFiles/kbluetooth4.dir/all] Error 2
make: *** [all] Error 2

I suppose I will have to wait for someone a bit more skilled than I to throw
it up on PPA or something.

On Mon, Jan 19, 2009 at 2:33 PM, Michael Marley
<email address hidden>wrote:

> You guys rock!
>
> --
> solid-bluetooth needs update for bluez 4.x
> https://bugs.launchpad.net/bugs/280997
> You received this bug notification because you are a direct subscriber
> of the bug.
>
> Status in KDE Base Components: Confirmed
> Status in Ubuntu Release Notes: Fix Released
> Status in "kdebase-workspace" source package in Ubuntu: Triaged
> Status in kdebase-workspace in Ubuntu Intrepid: Confirmed
>
> Bug description:
> Binary package hint: kdebase-workspace
>
> Bluetooth still doesn't work after the kdebluetooth fixes.
>
> :/usr/bin$ kbluetooth4-devicemanager
> kbluetooth4-devicemanager(8525)
> Solid::Control::ManagerBasePrivate::loadBackend: Backend loaded: "BlueZ"
> process 8525: arguments to dbus_message_new_method_call() were incorrect,
> assertion "path != NULL" failed in file dbus-message.c line 1070.
> This is normally a bug in some application using the D-Bus library.
> QDBusConnection: error: could not send message to service "org.bluez" path
> "" interface "org.freedesktop.DBus.Introspectable" member "Introspect"
> kbluetooth4-devicemanager(8525) DeviceMan::DeviceMan: Device Manager -
> Welcome
> kbluetooth4-devicemanager(8525) DeviceMan::getConfiguredDevices: Device
> List Size: 0
> kbluetooth4-devicemanager(8525) DeviceMan::slotStartWizard: Starting Wizard
> kbluetooth4-wizard(8542) Solid::Control::ManagerBasePrivate::loadBackend:
> Backend loaded: "BlueZ"
> process 8542: arguments to dbus_message_new_method_call() were incorrect,
> assertion "path != NULL" failed in file dbus-message.c line 1070.
> This is normally a bug in some application using the D-Bus library.
> QDBusConnection: error: could not send message to service "org.bluez" path
> "" interface "org.freedesktop.DBus.Introspectable" member "Introspect"
> Object::connect: No such slot BTWizard::slotValidatePage()
> kbluetooth4-wizard(8542) BTWizard::slotNext: Page ID: 1
> kbluetooth4-wizard(8542) BTWizard::slotNext: Page ID: 2
> kbluetooth4-wizard(8542) BTWizard::slotNext: page 2 reached!
> kbluetooth4-wizard(8542) BTWizard::slotSearch: searching...
> process 8542: arguments to dbus_message_new_method_call() were incorrect,
> assertion "path != NULL" failed in file dbus-message.c line 1070.
> This is normally a bug in some application using the D-Bus library.
> QDBusConnection: error: could not send message to service "org.bluez" path
> "" interface "org.bluez.Adapter" member "DiscoverDevices"
>