Ubuntu

k3b version 2.0.2-0ubuntu1 failed to build in oneiric

Reported by Matthias Klose on 2011-08-19
6
This bug affects 1 person
Affects Status Importance Assigned to Milestone
k3b (Ubuntu)
High
Unassigned
Oneiric
High
Unassigned

Bug Description

k3b version 2.0.2-0ubuntu1 failed to build in oneiric
Link to failed build: https://launchpad.net/ubuntu/+archive/test-rebuild-20110816/+build/2697445

Details about the rebuild:
http://people.ubuntuwire.org/~wgrant/rebuild-ftbfs-test/test-rebuild-20110816-oneiric.html

Direct link to the build log: https://launchpad.net/ubuntu/+archive/test-rebuild-20110816/+build/2697445/+files/buildlog_ubuntu-oneiric-i386.k3b_2.0.2-0ubuntu1_FAILEDTOBUILD.txt.gz

This log snippet might be of interest, since it triggered the matcher 'Purging chroot-autobuild'.
Excerpt 4597 lines into the build log:

/usr/bin/cmake -E cmake_progress_report /build/buildd/k3b-2.0.2/obj-i686-linux-gnu/CMakeFiles
[ 92%] Building CXX object src/CMakeFiles/k3b_bin.dir/k3bdiskinfoview.o
cd /build/buildd/k3b-2.0.2/obj-i686-linux-gnu/src && /usr/bin/c++ -D_BSD_SOURCE -D_XOPEN_SOURCE=500 -D_BSD_SOURCE -DQT_NO_STL -DQT_NO_CAST_TO_ASCII -D_REENTRANT -DKDE_DEPRECATED_WARNINGS -DKDE4_CMAKE_TOPLEVEL_DIR_LENGTH=13 -DQT3_SUPPORT -DQT3_SUPPORT_WARNINGS -g -O2 -Wnon-virtual-dtor -Wno-long-long -ansi -Wundef -Wcast-align -Wchar-subscripts -Wall -W -Wpointer-arith -Wformat-security -fno-exceptions -DQT_NO_EXCEPTIONS -fno-check-new -fno-common -Woverloaded-virtual -fno-threadsafe-statics -fvisibility=hidden -Werror=return-type -fvisibility-inlines-hidden -O2 -g -DNDEBUG -DQT_NO_DEBUG -I/build/buildd/k3b-2.0.2/obj-i686-linux-gnu/src -I/build/buildd/k3b-2.0.2/src -I/build/buildd/k3b-2.0.2/obj-i686-linux-gnu -I/build/buildd/k3b-2.0.2/libk3bdevice -I/build/buildd/k3b-2.0.2/libk3b/core -I/build/buildd/k3b-2.0.2/libk3b/plugin -I/build/buildd/k3b-2.0.2/libk3b/tools -I/build/buildd/k3b-2.0.2/libk3b/tools/qprocess -I/build/buildd/k3b-2.0.2/libk3b/tools/qprocess/private -I/build/buildd/k3b-2.0.2/libk3b/projects -I/build/buildd/k3b-2.0.2/libk3b/projects/audiocd -I/build/buildd/k3b-2.0.2/libk3b/projects/datacd -I/build/buildd/k3b-2.0.2/libk3b/projects/videocd -I/build/buildd/k3b-2.0.2/libk3b/projects/mixedcd -I/build/buildd/k3b-2.0.2/libk3b/jobs -I/build/buildd/k3b-2.0.2/libk3b/videodvd -I/build/buildd/k3b-2.0.2/obj-i686-linux-gnu/libk3b -I/build/buildd/k3b-2.0.2/libk3b/projects/movixcd -I/build/buildd/k3b-2.0.2/libk3b/projects/videodvd -I/build/buildd/k3b-2.0.2/obj-i686-linux-gnu/libk3b/core -I/build/buildd/k3b-2.0.2/obj-i686-linux-gnu/libk3b/plugin -I/build/buildd/k3b-2.0.2/obj-i686-linux-gnu/libk3b/tools -I/build/buildd/k3b-2.0.2/obj-i686-linux-gnu/libk3b/projects -I/build/buildd/k3b-2.0.2/obj-i686-linux-gnu/libk3b/jobs -I/build/buildd/k3b-2.0.2/src/projects -I/build/buildd/k3b-2.0.2/src/projects/kostore -I/build/buildd/k3b-2.0.2/libk3b/cddb -I/usr/include/KDE -I/usr/include/qt4/phonon -I/usr/include/qt4/QtXmlPatterns -I/usr/include/qt4/QtXml -I/usr/include/qt4/QtUiTools -I/usr/include/qt4/QtTest -I/usr/include/qt4/QtSvg -I/usr/include/qt4/QtSql -I/usr/include/qt4/QtScriptTools -I/usr/include/qt4/QtScript -I/usr/include/qt4/QtNetwork -I/usr/include/qt4/QtHelp -I/usr/include/qt4/QtDesigner -I/usr/include/qt4/QtDeclarative -I/usr/include/qt4/QtDBus -I/usr/include/qt4/Qt3Support -I/usr/include/qt4/QtGui -I/usr/include/qt4/QtCore -I/usr/include/qt4/Qt -I/usr/share/qt4/mkspecs/default -I/usr/include/qt4 -D_GNU_SOURCE -D_LARGEFILE64_SOURCE -D_FILE_OFFSET_BITS=64 -o CMakeFiles/k3b_bin.dir/k3bdiskinfoview.o -c /build/buildd/k3b-2.0.2/src/k3bdiskinfoview.cpp
/build/buildd/k3b-2.0.2/src/k3bdiskinfoview.cpp:37:29: fatal error: QtWebKit/QWebView: No such file or directory
compilation terminated.
make[3]: *** [src/CMakeFiles/k3b_bin.dir/k3bdiskinfoview.o] Error 1
make[3]: *** Waiting for unfinished jobs....
make[3]: Leaving directory `/build/buildd/k3b-2.0.2/obj-i686-linux-gnu'
make[2]: *** [src/CMakeFiles/k3b_bin.dir/all] Error 2
make[2]: Leaving directory `/build/buildd/k3b-2.0.2/obj-i686-linux-gnu'
make[1]: *** [all] Error 2
make[1]: Leaving directory `/build/buildd/k3b-2.0.2/obj-i686-linux-gnu'
dh_auto_build: make -j2 returned exit code 2
make: *** [build] Error 2
dpkg-buildpackage: error: debian/rules build gave error exit status 2
******************************************************************************
Build finished at 20110817-1106
FAILED [dpkg-buildpackage died]
Purging chroot-autobuild/build/buildd/k3b-2.0.2

Matthias Klose (doko) on 2011-08-19
Changed in k3b (Ubuntu):
milestone: none → ubuntu-11.10-beta-1
status: New → Confirmed
importance: Undecided → High
Colin Watson (cjwatson) wrote :

This part is easy, consisting of adding libqtwebkit-dev to Build-Depends; it wasn't done yet because then k3b ran into libav porting problems. I sent a patch for that to Scott Kitterman last night for testing, and he's going to get back to me.

Launchpad Janitor (janitor) wrote :

This bug was fixed in the package k3b - 2.0.2-0ubuntu2

---------------
k3b (2.0.2-0ubuntu2) oneiric; urgency=low

  * Build-depend on libqtwebkit-dev (LP: #829511).
  * Port to libav 0.7 API.
 -- Colin Watson <email address hidden> Fri, 26 Aug 2011 13:29:39 +0100

Changed in k3b (Ubuntu Oneiric):
status: Confirmed → Fix Released
To post a comment you must log in.
This report contains Public information  Edit
Everyone can see this information.

Other bug subscribers