gst-buzztard version 0.5.0-2 failed to build on i386

Bug #749262 reported by Matthias Klose on 2011-04-03
8
This bug affects 1 person
Affects Status Importance Assigned to Milestone
gst-buzztard (Debian)
Fix Released
Unknown
gst-buzztard (Ubuntu)
High
Unassigned
Oneiric
High
Unassigned

Bug Description

gst-buzztard version 0.5.0-2 failed to build on i386
Link to failed build: https://launchpad.net/ubuntu/+archive/test-rebuild-20110329/+buildjob/2394727

Direct link to the build log: https://launchpad.net/ubuntu/+archive/test-rebuild-20110329/+buildjob/2394727/+files/buildlog_ubuntu-natty-i386.gst-buzztard_0.5.0-2_FAILEDTOBUILD.txt.gz

This log snippet might be of interest, since it triggered the matcher 'Purging chroot-autobuild'.
Excerpt 2318 lines into the build log:

LD_LIBRARY_PATH=debian/libgstbuzztard0/usr/lib:/usr/lib/libfakeroot:/usr/lib64/libfakeroot:/usr/lib32/libfakeroot \
            dh_gstscancodecs

ERROR: Caught a segmentation fault while loading plugin file:
debian/gstreamer0.10-buzztard/usr/lib/gstreamer-0.10/libgstbml.so

Please either:
- remove it and restart.
- run with --gst-disable-segtrap --gst-disable-registry-fork and debug.

ERROR: Caught a segmentation fault while loading plugin file:
debian/gstreamer0.10-buzztard/usr/lib/gstreamer-0.10/libgstbml.so

Please either:
- remove it and restart.
- run with --gst-disable-segtrap --gst-disable-registry-fork and debug.
gst-codec-info-0.10 call failed: 'GST_REGISTRY=/tmp/dh_gstscancodecs.NGKm GST_PLUGIN_SYSTEM_PATH= GST_PLUGIN_PATH=debian/gstreamer0.10-buzztard/usr/lib/gstreamer-0.10 gst-codec-info-0.10 debian/gstreamer0.10-buzztard/usr/lib/gstreamer-0.10/libgstaudiodelay.so debian/gstreamer0.10-buzztard/usr/lib/gstreamer-0.10/libgstbml.so debian/gstreamer0.10-buzztard/usr/lib/gstreamer-0.10/libgstfluidsynth.so debian/gstreamer0.10-buzztard/usr/lib/gstreamer-0.10/libgstsimsyn.so > /tmp/dh_gstscancodecs.5kEX' rc: 65280 output:
ERROR: Caught a segmentation fault while loading plugin file:
debian/gstreamer0.10-buzztard/usr/lib/gstreamer-0.10/libgstbml.so

Please either:
- remove it and restart.
- run with --gst-disable-segtrap --gst-disable-registry-fork and debug.
make: *** [common-binary-fixup-arch] Error 255
dpkg-buildpackage: error: /usr/bin/fakeroot debian/rules binary gave error exit status 2
******************************************************************************
Build finished at 20110403-0928
FAILED [dpkg-buildpackage died]
Purging chroot-autobuild/build/buildd/gst-buzztard-0.5.0

tags: added: oneiric
Changed in gst-buzztard (Ubuntu):
milestone: none → oneiric-alpha-1
Changed in gst-buzztard (Ubuntu Oneiric):
milestone: oneiric-alpha-1 → oneiric-alpha-2
Changed in gst-buzztard (Ubuntu Oneiric):
milestone: oneiric-alpha-2 → none
status: New → Confirmed
tags: added: universe
Matthias Klose (doko) on 2011-09-08
Changed in gst-buzztard (Ubuntu Oneiric):
importance: Undecided → High
Changed in gst-buzztard (Debian):
status: Unknown → New
Andreas Moog (ampelbein) wrote :

This was fixed, in precise the package builds fine.

Changed in gst-buzztard (Ubuntu Oneiric):
status: Confirmed → Fix Released
Changed in gst-buzztard (Ubuntu):
status: Confirmed → Fix Released
Changed in gst-buzztard (Debian):
status: New → Fix Released
To post a comment you must log in.
This report contains Public information  Edit
Everyone can see this information.

Other bug subscribers

Remote bug watches

Bug watches keep track of this bug in other bug trackers.