grantlee fails to build in trusty on arm64

Bug #1451523 reported by Matthias Klose on 2015-05-04
6
This bug affects 1 person
Affects Status Importance Assigned to Milestone
grantlee (Ubuntu)
High
Unassigned

Bug Description

seen in a test rebuild, on with a plain build on the arm64 porter box

https://launchpad.net/ubuntu/+archive/test-rebuild-20150317/+build/7074784

82% tests passed, 2 tests failed out of 11

Total Test time (real) = 1.65 sec

The following tests FAILED:
          3 - testloadertags (OTHER_FAULT)
          5 - testscriptabletags (OTHER_FAULT)
Errors while running CTest
make[2]: *** [test] Error 8
make[2]: Leaving directory `/home/doko/tmp/grantlee-0.4.0/obj-aarch64-linux-gnu'
dh_auto_test: make -j4 test ARGS+=-j4 returned exit code 2
make[1]: *** [override_dh_auto_test] Error 2
make[1]: Leaving directory `/home/doko/tmp/grantlee-0.4.0'
make: *** [build-arch] Error 2
dpkg-buildpackage: error: debian/rules build-arch gave error exit status 2

Steveire (steveire) wrote :

QtScript issue? Someone with access needs to get more information.

To post a comment you must log in.
This report contains Public information  Edit
Everyone can see this information.

Other bug subscribers