gnutls26 version 2.10.5-1ubuntu2 failed to build in oneiric

Bug #829467 reported by Matthias Klose on 2011-08-19
6
This bug affects 1 person
Affects Status Importance Assigned to Milestone
gnutls26 (Ubuntu)
High
Colin Watson
Oneiric
High
Colin Watson

Bug Description

gnutls26 version 2.10.5-1ubuntu2 failed to build in oneiric
Link to failed build: https://launchpad.net/ubuntu/+archive/test-rebuild-20110816/+build/2694741

Details about the rebuild:
http://people.ubuntuwire.org/~wgrant/rebuild-ftbfs-test/test-rebuild-20110816-oneiric.html

Direct link to the build log: https://launchpad.net/ubuntu/+archive/test-rebuild-20110816/+build/2694741/+files/buildlog_ubuntu-oneiric-i386.gnutls26_2.10.5-1ubuntu2_FAILEDTOBUILD.txt.gz

This log snippet might be of interest, since it triggered the matcher 'Purging chroot-autobuild'.
Excerpt 5537 lines into the build log:

PASS: rfc2253-escape-test
===================================
4 of 45 tests failed
Please report to <email address hidden>
===================================
make[4]: *** [check-TESTS] Error 1
make[4]: Leaving directory `/build/buildd/gnutls26-2.10.5/tests'
make[3]: *** [check-am] Error 2
make[3]: Leaving directory `/build/buildd/gnutls26-2.10.5/tests'
make[2]: *** [check-recursive] Error 1
make[2]: Leaving directory `/build/buildd/gnutls26-2.10.5/tests'
make[1]: *** [check-recursive] Error 1
make[1]: Leaving directory `/build/buildd/gnutls26-2.10.5'
make: *** [debian/stamp-makefile-check] Error 2
dpkg-buildpackage: error: debian/rules build gave error exit status 2
******************************************************************************
Build finished at 20110817-0433
FAILED [dpkg-buildpackage died]
Purging chroot-autobuild/build/buildd/gnutls26-2.10.5

Related branches

Matthias Klose (doko) on 2011-08-19
Changed in gnutls26 (Ubuntu):
milestone: none → ubuntu-11.10-beta-1
Matthias Klose (doko) on 2011-08-19
Changed in gnutls26 (Ubuntu):
status: New → Invalid
Matthias Klose (doko) on 2011-08-19
Changed in gnutls26 (Ubuntu Oneiric):
importance: Undecided → High
status: Invalid → Confirmed
Colin Watson (cjwatson) on 2011-08-25
Changed in gnutls26 (Ubuntu Oneiric):
assignee: nobody → Colin Watson (cjwatson)
Launchpad Janitor (janitor) wrote :

This bug was fixed in the package gnutls26 - 2.10.5-1ubuntu3

---------------
gnutls26 (2.10.5-1ubuntu3) oneiric; urgency=low

  * Backport from Debian (Andreas Metzler, LP: #829467):
    - [20_gcrypt15compat.diff] Fix compatibility with gcrypt 1.5.
 -- Colin Watson <email address hidden> Thu, 25 Aug 2011 17:23:22 +0100

Changed in gnutls26 (Ubuntu Oneiric):
status: Confirmed → Fix Released
To post a comment you must log in.
This report contains Public information  Edit
Everyone can see this information.

Other bug subscribers