git test failures on every architecture except amd64

Bug #1243755 reported by Matthias Klose on 2013-10-23
6
This bug affects 1 person
Affects Status Importance Assigned to Milestone
git (Debian)
Fix Released
Unknown
git (Ubuntu)
High
Unassigned
Trusty
High
Unassigned

Bug Description

in trusty:

Annotations for merge
***************
ok 41 - cvs annotate

# still have 1 known breakage(s)
# failed 1 among remaining 40 test(s)
1..41
make[3]: *** [t9400-git-cvsserver-server.sh] Error 1
make[3]: Leaving directory `/build/buildd/git-1.8.4.1/t'
make[2]: *** [test] Error 2
make[2]: Leaving directory `/build/buildd/git-1.8.4.1/t'
make[1]: *** [test] Error 2
make[1]: Leaving directory `/build/buildd/git-1.8.4.1'
make: *** [build-arch-stamp] Error 2

Matthias Klose (doko) on 2013-10-23
Changed in git (Ubuntu):
importance: Undecided → High
status: New → Confirmed
Changed in git (Ubuntu Trusty):
milestone: none → ubuntu-14.04-alpha-1
Changed in git (Debian):
status: Unknown → New
Anders Kaseorg (andersk) wrote :

This works in saucy, but not in saucy with trusty’s perl stack, so this must have been triggered by the Perl 5.14→5.18 transition.

summary: - gi test failures on every architecture except amd64
+ git test failures on every architecture except amd64
Anders Kaseorg (andersk) wrote :

Yep. I did some digging and found that the failing test passes when run with PERL_HASH_SEED=0 in the environment.

Changed in git (Debian):
status: New → Fix Released
Jackson Doak (noskcaj) on 2014-02-23
Changed in git (Ubuntu Trusty):
status: Confirmed → Fix Released
To post a comment you must log in.
This report contains Public information  Edit
Everyone can see this information.

Other bug subscribers

Remote bug watches

Bug watches keep track of this bug in other bug trackers.