Activity log for bug #1201048

Date Who What changed Old value New value Message
2013-07-14 04:32:54 Rashad Kanavath bug added bug
2013-07-14 06:29:48 Rashad Kanavath branch linked lp:grass
2013-07-15 11:08:08 Matthias Klose gcc-4.7 (Ubuntu): status New Incomplete
2013-09-08 12:40:58 Rashad Kanavath gcc-4.7 (Ubuntu): status Incomplete New
2013-09-08 12:41:02 Rashad Kanavath description gcc -Wall -g -O -fPIC -I/build/buildd/grass70-7.0.0+0ubuntu2+28754~raring1/dist.i686-pc-linux-gnu/include -I/build/buildd/grass70-7.0.0+0ubuntu2+28754~raring1/dist.i686-pc-linux-gnu/include -D_LARGEFILE_SOURCE -D_FILE_OFFSET_BITS=64 -DPACKAGE=\""grasslibs"\" -I/build/buildd/grass70-7.0.0+0ubuntu2+28754~raring1/dist.i686-pc-linux-gnu/include -I/build/buildd/grass70-7.0.0+0ubuntu2+28754~raring1/dist.i686-pc-linux-gnu/include -o OBJ.i686-pc-linux-gnu/hevmax.o -c hevmax.c gcc -Wall -g -O -fPIC -I/build/buildd/grass70-7.0.0+0ubuntu2+28754~raring1/dist.i686-pc-linux-gnu/include -I/build/buildd/grass70-7.0.0+0ubuntu2+28754~raring1/dist.i686-pc-linux-gnu/include -D_LARGEFILE_SOURCE -D_FILE_OFFSET_BITS=64 -DPACKAGE=\""grasslibs"\" -I/build/buildd/grass70-7.0.0+0ubuntu2+28754~raring1/dist.i686-pc-linux-gnu/include -I/build/buildd/grass70-7.0.0+0ubuntu2+28754~raring1/dist.i686-pc-linux-gnu/include -o OBJ.i686-pc-linux-gnu/hmgen.o -c hmgen.c gcc -Wall -g -O -fPIC -I/build/buildd/grass70-7.0.0+0ubuntu2+28754~raring1/dist.i686-pc-linux-gnu/include -I/build/buildd/grass70-7.0.0+0ubuntu2+28754~raring1/dist.i686-pc-linux-gnu/include -D_LARGEFILE_SOURCE -D_FILE_OFFSET_BITS=64 -DPACKAGE=\""grasslibs"\" -I/build/buildd/grass70-7.0.0+0ubuntu2+28754~raring1/dist.i686-pc-linux-gnu/include -I/build/buildd/grass70-7.0.0+0ubuntu2+28754~raring1/dist.i686-pc-linux-gnu/include -o OBJ.i686-pc-linux-gnu/house.o -c house.c house.c: In function 'house': house.c:10:6: internal compiler error: in rewrite_use_nonlinear_expr, at tree-ssa-loop-ivopts.c:6215 Please submit a full bug report, with preprocessed source if appropriate. See <file:///usr/share/doc/gcc-4.7/README.Bugs> for instructions. Preprocessed source stored into /tmp/ccdY94cZ.out file, please attach this to your bugreport. make[6]: *** [OBJ.i686-pc-linux-gnu/house.o] Error 1 make[6]: Leaving directory `/build/buildd/grass70-7.0.0+0ubuntu2+28754~raring1/lib/external/ccmath' This bug report is from launchpad builder and here is the full log https://launchpadlibrarian.net/144900435/buildlog_ubuntu-raring-i386.grass70_7.0.0%2B0ubuntu2%2B28754~raring1_FAILEDTOBUILD.txt.gz search for 'error:' to seek for error. FYI amd64 raring, i386 and amd64 saucy, i386 and amd64 quantal builds fine this fails only for i386 build for raring. gcc -Wall -g -O -fPIC -I/build/buildd/grass70-7.0.0+0ubuntu2+28754~raring1/dist.i686-pc-linux-gnu/include -I/build/buildd/grass70-7.0.0+0ubuntu2+28754~raring1/dist.i686-pc-linux-gnu/include -D_LARGEFILE_SOURCE -D_FILE_OFFSET_BITS=64 -DPACKAGE=\""grasslibs"\" -I/build/buildd/grass70-7.0.0+0ubuntu2+28754~raring1/dist.i686-pc-linux-gnu/include -I/build/buildd/grass70-7.0.0+0ubuntu2+28754~raring1/dist.i686-pc-linux-gnu/include -o OBJ.i686-pc-linux-gnu/hevmax.o -c hevmax.c gcc -Wall -g -O -fPIC -I/build/buildd/grass70-7.0.0+0ubuntu2+28754~raring1/dist.i686-pc-linux-gnu/include -I/build/buildd/grass70-7.0.0+0ubuntu2+28754~raring1/dist.i686-pc-linux-gnu/include -D_LARGEFILE_SOURCE -D_FILE_OFFSET_BITS=64 -DPACKAGE=\""grasslibs"\" -I/build/buildd/grass70-7.0.0+0ubuntu2+28754~raring1/dist.i686-pc-linux-gnu/include -I/build/buildd/grass70-7.0.0+0ubuntu2+28754~raring1/dist.i686-pc-linux-gnu/include -o OBJ.i686-pc-linux-gnu/hmgen.o -c hmgen.c gcc -Wall -g -O -fPIC -I/build/buildd/grass70-7.0.0+0ubuntu2+28754~raring1/dist.i686-pc-linux-gnu/include -I/build/buildd/grass70-7.0.0+0ubuntu2+28754~raring1/dist.i686-pc-linux-gnu/include -D_LARGEFILE_SOURCE -D_FILE_OFFSET_BITS=64 -DPACKAGE=\""grasslibs"\" -I/build/buildd/grass70-7.0.0+0ubuntu2+28754~raring1/dist.i686-pc-linux-gnu/include -I/build/buildd/grass70-7.0.0+0ubuntu2+28754~raring1/dist.i686-pc-linux-gnu/include -o OBJ.i686-pc-linux-gnu/house.o -c house.c house.c: In function 'house': house.c:10:6: internal compiler error: in rewrite_use_nonlinear_expr, at tree-ssa-loop-ivopts.c:6215 Please submit a full bug report, with preprocessed source if appropriate. See <file:///usr/share/doc/gcc-4.7/README.Bugs> for instructions. Preprocessed source stored into /tmp/ccdY94cZ.out file, please attach this to your bugreport. make[6]: *** [OBJ.i686-pc-linux-gnu/house.o] Error 1 make[6]: Leaving directory `/build/buildd/grass70-7.0.0+0ubuntu2+28754~raring1/lib/external/ccmath' This bug report is from launchpad builder and here is the full log https://launchpadlibrarian.net/144900435/buildlog_ubuntu-raring-i386.grass70_7.0.0%2B0ubuntu2%2B28754~raring1_FAILEDTOBUILD.txt.gz search for 'error:' to seek for error. FYI amd64 raring, i386 and amd64 saucy, i386 and amd64 quantal builds fine this fails only for i386 build for raring.
2013-09-08 12:43:30 Rashad Kanavath attachment added Preprocessed source stored into /tmp/cchzKhtc.out file https://bugs.launchpad.net/ubuntu/+source/gcc-4.7/+bug/1201048/+attachment/3808830/+files/cchzKhtc.out
2013-10-22 03:05:49 Launchpad Janitor gcc-4.7 (Ubuntu): status New Confirmed