package libstdc++6-4.6-dev 4.6.3-1ubuntu5 failed to install/upgrade: error writing to '<standard output>': Input/output error

Bug #1738886 reported by Kia on 2017-12-18
8
This bug affects 1 person
Affects Status Importance Assigned to Milestone
gcc-4.6 (Ubuntu)
Undecided
Unassigned

Bug Description

idk

ProblemType: Package
DistroRelease: Ubuntu 12.04
Package: libstdc++6-4.6-dev 4.6.3-1ubuntu5
ProcVersionSignature: Ubuntu 3.2.0-126.169-generic 3.2.79
Uname: Linux 3.2.0-126-generic x86_64
NonfreeKernelModules: fglrx
ApportVersion: 2.0.1-0ubuntu17.6
Architecture: amd64
Date: Mon Dec 18 16:24:24 2017
DuplicateSignature: package:libstdc++6-4.6-dev:4.6.3-1ubuntu5:error writing to '<standard output>': Input/output error
ErrorMessage: error writing to '<standard output>': Input/output error
InstallationMedia: Xubuntu 12.04.4 LTS "Precise Pangolin" - Release amd64 (20140205)
MarkForUpload: True
SourcePackage: gcc-4.6
Title: package libstdc++6-4.6-dev 4.6.3-1ubuntu5 failed to install/upgrade: error writing to '<standard output>': Input/output error
UpgradeStatus: No upgrade log present (probably fresh install)

Kia (k2nabard) wrote :
tags: removed: need-duplicate-check
To post a comment you must log in.
This report contains Public information  Edit
Everyone can see this information.

Other bug subscribers