fraqtive version 0.4.5-3 failed to build on armel

Bug #791280 reported by Ricardo Salveti on 2011-06-01
6
This bug affects 1 person
Affects Status Importance Assigned to Milestone
fraqtive (Ubuntu)
Undecided
Unassigned

Bug Description

fraqtive version 0.4.5-3 failed to build on armel
Link to failed build: https://launchpad.net/ubuntu/+source/fraqtive/0.4.5-3/+build/2473269

Direct link to the build log: https://launchpad.net/ubuntu/+source/fraqtive/0.4.5-3/+build/2473269/+files/buildlog_ubuntu-oneiric-armel.fraqtive_0.4.5-3_FAILEDTOBUILD.txt.gz

This log snippet might be of interest, since it triggered the matcher 'Purging chroot-autobuild'.
Excerpt 1248 lines into the build log:

meshview.cpp: In member function 'void MeshView::generateTexture()':
meshview.cpp:355:20: error: 'GL_TEXTURE_1D' was not declared in this scope
meshview.cpp:356:95: error: 'gluBuild1DMipmaps' was not declared in this scope
meshview.cpp: In member function 'void MeshView::initializeVertices()':
meshview.cpp:386:52: error: 'glVertexPointer' was not declared in this scope
meshview.cpp:387:26: error: 'GL_VERTEX_ARRAY' was not declared in this scope
meshview.cpp:387:42: error: 'glEnableClientState' was not declared in this scope
meshview.cpp:388:60: error: 'glTexCoordPointer' was not declared in this scope
meshview.cpp:389:26: error: 'GL_TEXTURE_COORD_ARRAY' was not declared in this scope
make[2]: *** [../tmp/debug/meshview.o] Error 1
make[2]: Leaving directory `/build/buildd/fraqtive-0.4.5/src'
make[1]: *** [sub-src-make_default] Error 2
make[1]: Leaving directory `/build/buildd/fraqtive-0.4.5'
make: *** [build-stamp] Error 2
dpkg-buildpackage: error: debian/rules build gave error exit status 2
******************************************************************************
Build finished at 20110509-1724
FAILED [dpkg-buildpackage died]
Purging chroot-autobuild/build/buildd/fraqtive-0.4.5

To post a comment you must log in.
This report contains Public information  Edit
Everyone can see this information.

Other bug subscribers