"make check-style" fails

Bug #1226691 reported by Chris Coulson on 2013-09-17
6
This bug affects 1 person
Affects Status Importance Assigned to Milestone
firefox (Ubuntu)
Medium
Unassigned

Bug Description

(cd /build/buildd/firefox-trunk-26.0~a1~hg20130916r147348/js/src && /build/buildd/firefox-trunk-26.0~a1~hg20130916r147348/obj-x86_64-linux-gnu/_virtualenv/bin/python config/check_spidermonkey_style.py);
Traceback (most recent call last):
  File "config/check_spidermonkey_style.py", line 591, in <module>
    main()
  File "config/check_spidermonkey_style.py", line 580, in main
    ok = check_style()
  File "config/check_spidermonkey_style.py", line 246, in check_style
    for filename in get_all_filenames():
  File "config/check_spidermonkey_style.py", line 229, in get_all_filenames
    raise Exception('failed to run any of the repo manifest commands', cmds)
Exception: ('failed to run any of the repo manifest commands', [['hg', 'manifest', '-q'], ['git', 'ls-files', '--full-name', '../..']])
make[2]: *** [check-style] Error 1
make[2]: Leaving directory `/build/buildd/firefox-trunk-26.0~a1~hg20130916r147348/obj-x86_64-linux-gnu/js/src'
make[1]: *** [check] Error 2
make[1]: Leaving directory `/build/buildd/firefox-trunk-26.0~a1~hg20130916r147348/obj-x86_64-linux-gnu'

tags: added: moz-test-failure
Changed in firefox (Ubuntu):
importance: Undecided → Medium
status: New → Triaged
To post a comment you must log in.
This report contains Public information  Edit
Everyone can see this information.

Other bug subscribers