uriloader/exthandler/tests/unit/test_handlerService.js xpcshell test failure

Bug #1158899 reported by Chris Coulson on 2013-03-22
6
This bug affects 1 person
Affects Status Importance Assigned to Milestone
firefox (Ubuntu)
Medium
Unassigned

Bug Description

TEST-INFO | /home/chr1s/Desktop/tests/xpcshell/tests/uriloader/exthandler/tests/unit/test_handlerService.js | running test ...
TEST-UNEXPECTED-FAIL | /home/chr1s/Desktop/tests/xpcshell/tests/uriloader/exthandler/tests/unit/test_handlerService.js | test failed (with xpcshell return code: 0), see following log:
>>>>>>>

TEST-INFO | (xpcshell/head.js) | test 1 pending
*** HandlerServiceTest: getFile: requesting ProfLDS
*** HandlerServiceTest: the following NS_ERROR_FAILURE exception in nsIDirectoryServiceProvider::getFile is expected, as we don't provide the 'ProfLDS' file
*** HandlerServiceTest: getFile: requesting ProfDS
*** HandlerServiceTest: the following NS_ERROR_FAILURE exception in nsIDirectoryServiceProvider::getFile is expected, as we don't provide the 'ProfDS' file
*** HandlerServiceTest: getFile: requesting UMimTyp
*** HandlerServiceTest: getFile: requesting ProfD
*** HandlerServiceTest: the following NS_ERROR_FAILURE exception in nsIDirectoryServiceProvider::getFile is expected, as we don't provide the 'ProfD' file
*** HandlerServiceTest: getFile: requesting TmpD
*** HandlerServiceTest: the following NS_ERROR_FAILURE exception in nsIDirectoryServiceProvider::getFile is expected, as we don't provide the 'TmpD' file
*** HandlerServiceTest: getFile: requesting Home
*** HandlerServiceTest: the following NS_ERROR_FAILURE exception in nsIDirectoryServiceProvider::getFile is expected, as we don't provide the 'Home' file

TEST-PASS | /home/chr1s/Desktop/tests/xpcshell/tests/uriloader/exthandler/tests/unit/test_handlerService.js | [run_test : 85] true == true

TEST-PASS | /home/chr1s/Desktop/tests/xpcshell/tests/uriloader/exthandler/tests/unit/test_handlerService.js | [run_test : 87] nonexistent/type == nonexistent/type

TEST-PASS | /home/chr1s/Desktop/tests/xpcshell/tests/uriloader/exthandler/tests/unit/test_handlerService.js | [run_test : 90] nonexistent/type == nonexistent/type

TEST-PASS | /home/chr1s/Desktop/tests/xpcshell/tests/uriloader/exthandler/tests/unit/test_handlerService.js | [run_test : 93] 0 == 0

TEST-PASS | /home/chr1s/Desktop/tests/xpcshell/tests/uriloader/exthandler/tests/unit/test_handlerService.js | [run_test : 94] null == null

TEST-PASS | /home/chr1s/Desktop/tests/xpcshell/tests/uriloader/exthandler/tests/unit/test_handlerService.js | [run_test : 95] 0 == 0

TEST-PASS | /home/chr1s/Desktop/tests/xpcshell/tests/uriloader/exthandler/tests/unit/test_handlerService.js | [run_test : 96] true == true

TEST-PASS | /home/chr1s/Desktop/tests/xpcshell/tests/uriloader/exthandler/tests/unit/test_handlerService.js | [run_test : 100] ==

TEST-PASS | /home/chr1s/Desktop/tests/xpcshell/tests/uriloader/exthandler/tests/unit/test_handlerService.js | [run_test : 101] false == false

TEST-PASS | /home/chr1s/Desktop/tests/xpcshell/tests/uriloader/exthandler/tests/unit/test_handlerService.js | [run_test : 102] ==

TEST-PASS | /home/chr1s/Desktop/tests/xpcshell/tests/uriloader/exthandler/tests/unit/test_handlerService.js | [run_test : 124] 1 == 1

TEST-PASS | /home/chr1s/Desktop/tests/xpcshell/tests/uriloader/exthandler/tests/unit/test_handlerService.js | [run_test : 125] true == true

TEST-PASS | /home/chr1s/Desktop/tests/xpcshell/tests/uriloader/exthandler/tests/unit/test_handlerService.js | [run_test : 132] 0 == 0

TEST-PASS | /home/chr1s/Desktop/tests/xpcshell/tests/uriloader/exthandler/tests/unit/test_handlerService.js | [run_test : 133] false == false

TEST-PASS | /home/chr1s/Desktop/tests/xpcshell/tests/uriloader/exthandler/tests/unit/test_handlerService.js | [run_test : 142] 0 == 0

TEST-PASS | /home/chr1s/Desktop/tests/xpcshell/tests/uriloader/exthandler/tests/unit/test_handlerService.js | [run_test : 143] true == true

TEST-PASS | /home/chr1s/Desktop/tests/xpcshell/tests/uriloader/exthandler/tests/unit/test_handlerService.js | [run_test : 151] 0 == 0

TEST-UNEXPECTED-FAIL | /home/chr1s/Desktop/tests/xpcshell/tests/uriloader/exthandler/tests/unit/test_handlerService.js | true == false - See following stack:
JS frame :: /home/chr1s/Desktop/tests/xpcshell/head.js :: do_throw :: line 461
JS frame :: /home/chr1s/Desktop/tests/xpcshell/head.js :: do_report_result :: line 563
JS frame :: /home/chr1s/Desktop/tests/xpcshell/head.js :: _do_check_eq :: line 573
JS frame :: /home/chr1s/Desktop/tests/xpcshell/head.js :: do_check_eq :: line 580
JS frame :: /home/chr1s/Desktop/tests/xpcshell/head.js :: do_check_false :: line 608
JS frame :: /home/chr1s/Desktop/tests/xpcshell/tests/uriloader/exthandler/tests/unit/test_handlerService.js :: run_test :: line 157
JS frame :: /home/chr1s/Desktop/tests/xpcshell/head.js :: _execute_test :: line 325
JS frame :: -e :: <TOP_LEVEL> :: line 1
native frame :: <unknown filename> :: <TOP_LEVEL> :: line 0

TEST-INFO | (xpcshell/head.js) | exiting test
<<<<<<<

Changed in firefox (Ubuntu):
importance: Undecided → Medium
status: New → Triaged
tags: added: moz-test-failure
To post a comment you must log in.
This report contains Public information  Edit
Everyone can see this information.

Other bug subscribers