evolution-indicator version 0.2.17-0ubuntu1 failed to build in oneiric

Bug #829461 reported by Matthias Klose on 2011-08-19
6
This bug affects 1 person
Affects Status Importance Assigned to Milestone
evolution-indicator (Ubuntu)
High
Ken VanDine
Oneiric
High
Ken VanDine

Bug Description

evolution-indicator version 0.2.17-0ubuntu1 failed to build in oneiric
Link to failed build: https://launchpad.net/ubuntu/+archive/test-rebuild-20110816/+build/2692527

Details about the rebuild:
http://people.ubuntuwire.org/~wgrant/rebuild-ftbfs-test/test-rebuild-20110816-oneiric.html

Direct link to the build log: https://launchpad.net/ubuntu/+archive/test-rebuild-20110816/+build/2692527/+files/buildlog_ubuntu-oneiric-i386.evolution-indicator_0.2.17-0ubuntu1_FAILEDTOBUILD.txt.gz

This log snippet might be of interest, since it triggered the matcher 'Purging chroot-autobuild'.
Excerpt 1969 lines into the build log:

                  libcanberra
                  gtkhtml-editor-4.0
                  unity
                  ) were not met:

No package 'indicate-0.5' found

Consider adjusting the PKG_CONFIG_PATH environment variable if you
installed software in a non-standard prefix.

Alternatively, you may set the environment variables DEPS_CFLAGS
and DEPS_LIBS to avoid the need to call pkg-config.
See the pkg-config man page for more details.
make: *** [debian/stamp-autotools] Error 1
dpkg-buildpackage: error: debian/rules build gave error exit status 2
******************************************************************************
Build finished at 20110817-0239
FAILED [dpkg-buildpackage died]
Purging chroot-autobuild/build/buildd/evolution-indicator-0.2.17

Matthias Klose (doko) on 2011-08-19
Changed in evolution-indicator (Ubuntu):
milestone: none → ubuntu-11.10-beta-1
Changed in evolution-indicator (Ubuntu Oneiric):
status: New → Confirmed
importance: Undecided → High
Matthias Klose (doko) on 2011-08-19
Changed in evolution-indicator (Ubuntu):
status: Confirmed → Invalid
Matthias Klose (doko) on 2011-08-19
Changed in evolution-indicator (Ubuntu Oneiric):
status: Invalid → Confirmed
Changed in evolution-indicator (Ubuntu Oneiric):
assignee: nobody → Ken VanDine (ken-vandine)
Launchpad Janitor (janitor) wrote :

This bug was fixed in the package evolution-indicator - 0.2.18-0ubuntu1

---------------
evolution-indicator (0.2.18-0ubuntu1) oneiric; urgency=low

  * New upstream release.
    - build against indicate-0.6 (LP: #829461)
 -- Ken VanDine <email address hidden> Tue, 23 Aug 2011 22:20:31 -0400

Changed in evolution-indicator (Ubuntu Oneiric):
status: Confirmed → Fix Released
To post a comment you must log in.
This report contains Public information  Edit
Everyone can see this information.

Other bug subscribers