cyrus-sasl2 fails to build from source in maverick

Bug #600180 reported by Matthias Klose
14
This bug affects 2 people
Affects Status Importance Assigned to Milestone
cyrus-sasl2 (Ubuntu)
High
Colin Watson
Maverick
High
Colin Watson

Bug Description

seen in a test rebuild too
https://launchpad.net/ubuntu/+archive/test-rebuild-20100628/+build/1819013

make[1]: Entering directory `/build/buildd/cyrus-sasl2-2.1.23.dfsg1/sample'
gcc -g -o sample-server sample-server.c -I. -I/build/buildd/cyrus-sasl2-2.1.23.dfsg1/include -L/build/buildd/cyrus-sasl2-2.1.23.dfsg1/lib/.libs -lsasl2
sample-server.c:69: error: conflicting types for 'getsubopt'
//usr/include/stdlib.h:896: note: previous declaration of 'getsubopt' was here
make[1]: *** [sample-server] Error 1
make[1]: Leaving directory `/build/buildd/cyrus-sasl2-2.1.23.dfsg1/sample'
make: *** [build-arch-stamp] Error 2

Matthias Klose (doko)
Changed in cyrus-sasl2 (Ubuntu Maverick):
importance: Undecided → High
milestone: none → maverick-alpha-3
status: New → Confirmed
Colin Watson (cjwatson)
Changed in cyrus-sasl2 (Ubuntu Maverick):
assignee: nobody → Colin Watson (cjwatson)
Revision history for this message
Launchpad Janitor (janitor) wrote :

This bug was fixed in the package cyrus-sasl2 - 2.1.23.dfsg1-5ubuntu2

---------------
cyrus-sasl2 (2.1.23.dfsg1-5ubuntu2) maverick; urgency=low

  * Remove unhelpful debian/sample/config.h, stop copying it in, and arrange
    to have the autoconf-generated config.h included when building sample/
    instead (LP: #600180).
 -- Colin Watson <email address hidden> Fri, 09 Jul 2010 12:10:40 +0100

Changed in cyrus-sasl2 (Ubuntu Maverick):
status: Confirmed → Fix Released
To post a comment you must log in.
This report contains Public information  Edit
Everyone can see this information.

Duplicates of this bug

Other bug subscribers