cuneiform version 1.1.0+dfsg-1 failed to build on armel

Bug #791305 reported by Ricardo Salveti on 2011-06-01
6
This bug affects 1 person
Affects Status Importance Assigned to Milestone
cuneiform (Ubuntu)
Undecided
Unassigned

Bug Description

cuneiform version 1.1.0+dfsg-1 failed to build on armel
Link to failed build: https://launchpad.net/ubuntu/+source/cuneiform/1.1.0+dfsg-1/+build/2496045

Direct link to the build log: https://launchpad.net/ubuntu/+source/cuneiform/1.1.0+dfsg-1/+build/2496045/+files/buildlog_ubuntu-oneiric-armel.cuneiform_1.1.0%2Bdfsg-1_FAILEDTOBUILD.txt.gz

This log snippet might be of interest, since it triggered the matcher 'Purging chroot-autobuild'.
Excerpt 3096 lines into the build log:

@@ -1,7 +1,7 @@
-This is a lot of 12 poiet text to test the
-ocr code aed see if it works oe all types
+This is a lot of 12 point text to test the
+ocr code and see if it works on all types
 of file format.
-The quick browe dog jumped over the
+The quick brown dog jumped over the
 lazy fox. The quick brown dog jumped
 over the lazy fox. The quick brown dog
 jumped over the lazy fox. The quick
make[1]: *** [images/phototest.tif.out] Error 1
make[1]: Leaving directory `/build/buildd/cuneiform-1.1.0+dfsg'
make: *** [build] Error 2
dpkg-buildpackage: error: debian/rules build gave error exit status 2
******************************************************************************
Build finished at 20110513-2301
FAILED [dpkg-buildpackage died]
Purging chroot-autobuild/build/buildd/cuneiform-1.1.0+dfsg

To post a comment you must log in.
This report contains Public information  Edit
Everyone can see this information.

Other bug subscribers