cinder fails to build with python 2.7.9 in trusty

Bug #1451453 reported by Matthias Klose on 2015-05-04
6
This bug affects 1 person
Affects Status Importance Assigned to Milestone
cinder (Ubuntu)
High
Unassigned
Wily
Undecided
Unassigned
Xenial
Undecided
Unassigned
keystone (Ubuntu)
High
Unassigned
Wily
Undecided
Unassigned
Xenial
Undecided
Unassigned
neutron (Ubuntu)
High
Unassigned
Wily
Undecided
Unassigned
Xenial
Undecided
Unassigned
python-glanceclient (Ubuntu)
High
Unassigned
Wily
Undecided
Unassigned
Xenial
Undecided
Unassigned

Bug Description

seen in a test rebuild in trusty with python 2.7.9:
https://launchpad.net/ubuntu/+archive/test-rebuild-20150501-updates/+build/7375304

Traceback (most recent call last):
  File "/build/buildd/cinder-2014.1.4/cinder/tests/test_wsgi.py", line 165, in test_app_using_ssl
    response = urllib2.urlopen('https://127.0.0.1:%d/' % server.port)
  File "/usr/lib/python2.7/urllib2.py", line 154, in urlopen
    return opener.open(url, data, timeout)
  File "/usr/lib/python2.7/urllib2.py", line 431, in open
    response = self._open(req, data)
  File "/usr/lib/python2.7/urllib2.py", line 449, in _open
    '_open', req)
  File "/usr/lib/python2.7/urllib2.py", line 409, in _call_chain
    result = func(*args)
  File "/usr/lib/python2.7/urllib2.py", line 1240, in https_open
    context=self._context)
  File "/usr/lib/python2.7/urllib2.py", line 1197, in do_open
    raise URLError(err)
URLError: <urlopen error [SSL: CERTIFICATE_VERIFY_FAILED] certificate verify failed (_ssl.c:590)>

Ran 3020 tests in 142.297s

FAILED (failures=2)

Matthias Klose (doko) wrote :

same for keystone

Changed in keystone (Ubuntu):
importance: Undecided → High
milestone: none → trusty-updates
status: New → Confirmed
Matthias Klose (doko) on 2015-05-04
Changed in neutron (Ubuntu):
importance: Undecided → High
milestone: none → trusty-updates
status: New → Confirmed
Matthias Klose (doko) on 2015-05-04
Changed in python-glanceclient (Ubuntu):
importance: Undecided → High
milestone: none → trusty-updates
status: New → Confirmed
James Page (james-page) on 2015-09-11
Changed in cinder (Ubuntu):
status: Confirmed → Triaged
Changed in keystone (Ubuntu):
status: Confirmed → Triaged
Changed in neutron (Ubuntu):
status: Confirmed → Triaged
Changed in python-glanceclient (Ubuntu):
status: Confirmed → Triaged
James Page (james-page) on 2017-10-20
Changed in cinder (Ubuntu):
status: Triaged → Won't Fix
Changed in cinder (Ubuntu Wily):
status: New → Won't Fix
Changed in cinder (Ubuntu Xenial):
status: New → Invalid
Changed in keystone (Ubuntu):
status: Triaged → Won't Fix
Changed in keystone (Ubuntu Wily):
status: New → Won't Fix
Changed in keystone (Ubuntu Xenial):
status: New → Won't Fix
Changed in neutron (Ubuntu):
status: Triaged → Won't Fix
Changed in neutron (Ubuntu Wily):
status: New → Won't Fix
Changed in neutron (Ubuntu Xenial):
status: New → Won't Fix
Changed in python-glanceclient (Ubuntu):
status: Triaged → Won't Fix
Changed in python-glanceclient (Ubuntu Wily):
status: New → Won't Fix
Changed in python-glanceclient (Ubuntu Xenial):
status: New → Won't Fix
To post a comment you must log in.
This report contains Public information  Edit
Everyone can see this information.

Other bug subscribers