cardstories version 1.0.6-1 failed to build in oneiric

Bug #831344 reported by Matthias Klose on 2011-08-22
6
This bug affects 1 person
Affects Status Importance Assigned to Milestone
cardstories (Debian)
Fix Released
Unknown
cardstories (Ubuntu)
High
Barry Warsaw
Oneiric
High
Barry Warsaw

Bug Description

cardstories version 1.0.5-1 failed to build in oneiric
Link to failed build: https://launchpad.net/ubuntu/+archive/test-rebuild-20110816/+build/2689905

Details about the rebuild:
http://people.ubuntuwire.org/~wgrant/rebuild-ftbfs-test/test-rebuild-20110816-oneiric.html

Direct link to the build log: https://launchpad.net/ubuntu/+archive/test-rebuild-20110816/+build/2689905/+files/buildlog_ubuntu-oneiric-i386.cardstories_1.0.5-1_FAILEDTOBUILD.txt.gz

This log snippet might be of interest, since it triggered the matcher 'Purging chroot-autobuild'.
Excerpt 483 lines into the build log:

exceptions.AssertionError: 200000000000 is not greater than or equal to 0 seconds

__main__.CardstoriesServiceTest.test08_poll
-------------------------------------------------------------------------------
Ran 19 tests in 1.335s

FAILED (errors=1, successes=18)
make[3]: *** [check] Error 1
make[3]: Leaving directory `/build/buildd/cardstories-1.0.5/tests'
make[2]: *** [check] Error 2
make[2]: Leaving directory `/build/buildd/cardstories-1.0.5'
make[1]: *** [override_dh_auto_build] Error 2
make[1]: Leaving directory `/build/buildd/cardstories-1.0.5'
make: *** [build] Error 2
dpkg-buildpackage: error: debian/rules build gave error exit status 2
******************************************************************************
Build finished at 20110820-2023
FAILED [dpkg-buildpackage died]
Purging chroot-autobuild/build/buildd/cardstories-1.0.5

Matthias Klose (doko) on 2011-08-22
Changed in cardstories (Ubuntu):
status: New → Confirmed
importance: Undecided → High
Barry Warsaw (barry) wrote :

1.0.6-1 seemed to build just fine for me. See attached build log.

Changed in cardstories (Ubuntu Oneiric):
status: Confirmed → Incomplete
Matthias Klose (doko) wrote :

failed again on the buildd

Changed in cardstories (Ubuntu Oneiric):
status: Incomplete → Confirmed
Barry Warsaw (barry) wrote :

Okay, I believe this is a bug in the test related to i386/amd64 (i.e. sys.maxint). I'm building an i386 VM now to test my theory.

Barry Warsaw (barry) on 2011-09-22
Changed in cardstories (Ubuntu Oneiric):
status: Confirmed → In Progress
assignee: nobody → Barry Warsaw (barry)
milestone: none → ubuntu-11.10-beta-2
Barry Warsaw (barry) on 2011-09-22
summary: - cardstories version 1.0.5-1 failed to build in oneiric
+ cardstories version 1.0.6-1 failed to build in oneiric
Changed in cardstories (Debian):
status: Unknown → New
Launchpad Janitor (janitor) wrote :

This bug was fixed in the package cardstories - 1.0.6-1ubuntu1

---------------
cardstories (1.0.6-1ubuntu1) oneiric; urgency=low

  * Fix test where poll interval was > sys.maxint on i386. (LP: #831344)
 -- Barry Warsaw <email address hidden> Wed, 21 Sep 2011 21:20:09 -0400

Changed in cardstories (Ubuntu Oneiric):
status: In Progress → Fix Released
Changed in cardstories (Debian):
status: New → Fix Committed
Changed in cardstories (Debian):
status: Fix Committed → Fix Released
To post a comment you must log in.
This report contains Public information  Edit
Everyone can see this information.

Other bug subscribers

Remote bug watches

Bug watches keep track of this bug in other bug trackers.