baloo-kf5 fails to build in 16.04 LTS

Bug #1597427 reported by Matthias Klose on 2016-06-29
8
This bug affects 1 person
Affects Status Importance Assigned to Milestone
baloo-kf5 (Ubuntu)
High
Unassigned
Xenial
High
Unassigned

Bug Description

baloo-kf5 (kubuntu package set) fails to build in 16.04 LTS

/«PKGBUILDDIR»/src/codecs/positioncodec.cpp
/«PKGBUILDDIR»/src/file/extractor/autotests/iohandlertest.cpp: In member function ‘void Baloo::IOHandlerTest::testInput()’:
/«PKGBUILDDIR»/src/file/extractor/autotests/iohandlertest.cpp:57:21: error: ‘pow’ is not a member of ‘std’
         quint64 a = std::pow(16, i);
                     ^
make[4]: *** [src/file/extractor/autotests/CMakeFiles/extractorIOTest.dir/iohandlertest.cpp.o] Error 1
src/file/extractor/autotests/CMakeFiles/extractorIOTest.dir/build.make:65: recipe for target 'src/file/extractor/autotests/CMakeFiles/extractorIOTest.dir/iohandlertest.cpp.o' failed
make[4]: Leaving directory '/«PKGBUILDDIR»/obj-x86_64-linux-gnu'
make[3]: *** [src/file/extractor/autotests/CMakeFiles/extractorIOTest.dir/all] Error 2
CMakeFiles/Makefile2:2568: recipe for target 'src/file/extractor/autotests/CMakeFiles/extractorIOTest.dir/all' failed

Matthias Klose (doko) wrote :

already fixed in yakkety

tags: added: ftbfs
Changed in baloo-kf5 (Ubuntu):
status: New → Fix Released

Hello Matthias, or anyone else affected,

Accepted baloo-kf5 into xenial-proposed. The package will build now and be available at https://launchpad.net/ubuntu/+source/baloo-kf5/5.18.0-0ubuntu1.1 in a few hours, and then in the -proposed repository.

Please help us by testing this new package. See https://wiki.ubuntu.com/Testing/EnableProposed for documentation how to enable and use -proposed. Your feedback will aid us getting this update out to other Ubuntu users.

If this package fixes the bug for you, please add a comment to this bug, mentioning the version of the package you tested, and change the tag from verification-needed to verification-done. If it does not fix the bug for you, please add a comment stating that, and change the tag to verification-failed. In either case, details of your testing will help us make a better decision.

Further information regarding the verification process can be found at https://wiki.ubuntu.com/QATeam/PerformingSRUVerification . Thank you in advance!

Changed in baloo-kf5 (Ubuntu Xenial):
status: New → Fix Committed
tags: added: verification-needed
Matthias Klose (doko) wrote :

the package successfully built on all architectures

tags: added: verification-done
removed: verification-needed
Changed in baloo-kf5 (Ubuntu Xenial):
importance: Undecided → High
Changed in baloo-kf5 (Ubuntu):
importance: Undecided → High
Launchpad Janitor (janitor) wrote :

This bug was fixed in the package baloo-kf5 - 5.18.0-0ubuntu1.1

---------------
baloo-kf5 (5.18.0-0ubuntu1.1) xenial-proposed; urgency=medium

  * SRU: LP: #1597427. Fix build failure.

 -- Matthias Klose <email address hidden> Wed, 29 Jun 2016 18:18:13 +0200

Changed in baloo-kf5 (Ubuntu Xenial):
status: Fix Committed → Fix Released

The verification of the Stable Release Update for baloo-kf5 has completed successfully and the package has now been released to -updates. Subsequently, the Ubuntu Stable Release Updates Team is being unsubscribed and will not receive messages about this bug report. In the event that you encounter a regression using the package from -updates please report a new bug using ubuntu-bug and tag the bug report regression-update so we can easily find any regressions.

To post a comment you must log in.
This report contains Public information  Edit
Everyone can see this information.

Other bug subscribers