avogadro version 1.0.1-3.2ubuntu1 failed to build on armel

Bug #745857 reported by Steve Langasek on 2011-03-30
6
This bug affects 1 person
Affects Status Importance Assigned to Milestone
avogadro (Ubuntu)
Undecided
Unassigned

Bug Description

avogadro version 1.0.1-3.2ubuntu1 failed to build on armel
Link to failed build: https://launchpad.net/ubuntu/+source/avogadro/1.0.1-3.2ubuntu1/+buildjob/2416036

Direct link to the build log: https://launchpad.net/ubuntu/+source/avogadro/1.0.1-3.2ubuntu1/+buildjob/2416036/+files/buildlog_ubuntu-natty-armel.avogadro_1.0.1-3.2ubuntu1_FAILEDTOBUILD.txt.gz

This log snippet might be of interest, since it triggered the matcher 'Purging chroot-autobuild'.
Excerpt 1818 lines into the build log:

/usr/bin/cmake -E cmake_progress_report /build/buildd/avogadro-1.0.1/obj-arm-linux-gnueabi/CMakeFiles
[ 12%] Building CXX object libavogadro/src/CMakeFiles/avogadro.dir/navigate.cpp.o
cd /build/buildd/avogadro-1.0.1/obj-arm-linux-gnueabi/libavogadro/src && /usr/bin/g++ -Davogadro_EXPORTS -D_BSD_SOURCE -DHAVE_GCC_VISIBILITY -DSIP_4_8 -DENABLE_PYTHON -DQT_GUI_LIB -DQT_NETWORK_LIB -DQT_CORE_LIB -DQT_NO_DEBUG -g -O2 -g -O2 -fvisibility=hidden -fvisibility-inlines-hidden -fpermissive -O2 -DNDEBUG -DQT_NO_DEBUG_OUTPUT -fPIC -I/build/buildd/avogadro-1.0.1/obj-arm-linux-gnueabi/libavogadro/include -I/usr/include/qt4 -I/usr/include/qt4/QtGui -I/usr/include/qt4/QtNetwork -I/usr/include/qt4/QtCore -I/build/buildd/avogadro-1.0.1/obj-arm-linux-gnueabi/libavogadro/src -I/usr/include/eigen2 -I/usr/include/openbabel-2.0 -I/usr/include/python2.7 -o CMakeFiles/avogadro.dir/navigate.cpp.o -c /build/buildd/avogadro-1.0.1/libavogadro/src/navigate.cpp
In file included from /build/buildd/avogadro-1.0.1/libavogadro/src/navigate.h:29:0,
                 from /build/buildd/avogadro-1.0.1/libavogadro/src/navigate.cpp:26:
/build/buildd/avogadro-1.0.1/obj-arm-linux-gnueabi/libavogadro/include/avogadro/glwidget.h:35:21: fatal error: QGLWidget: No such file or directory
compilation terminated.
make[3]: *** [libavogadro/src/CMakeFiles/avogadro.dir/navigate.cpp.o] Error 1
make[3]: Leaving directory `/build/buildd/avogadro-1.0.1/obj-arm-linux-gnueabi'
make[2]: *** [libavogadro/src/CMakeFiles/avogadro.dir/all] Error 2
make[2]: Leaving directory `/build/buildd/avogadro-1.0.1/obj-arm-linux-gnueabi'
make[1]: *** [all] Error 2
make[1]: Leaving directory `/build/buildd/avogadro-1.0.1/obj-arm-linux-gnueabi'
make: *** [debian/stamp-makefile-build] Error 2
dpkg-buildpackage: error: debian/rules build gave error exit status 2
******************************************************************************
Build finished at 20110329-2009
FAILED [dpkg-buildpackage died]
Purging chroot-autobuild/build/buildd/avogadro-1.0.1

To post a comment you must log in.
This report contains Public information  Edit
Everyone can see this information.

Other bug subscribers