autogen version 1:5.12-0.1ubuntu1 failed to build in oneiric

Bug #829486 reported by Matthias Klose on 2011-08-19
8
This bug affects 1 person
Affects Status Importance Assigned to Milestone
autogen (Ubuntu)
High
Unassigned
Oneiric
High
Unassigned

Bug Description

autogen version 1:5.12-0.1ubuntu1 failed to build in oneiric
Link to failed build: https://launchpad.net/ubuntu/+archive/test-rebuild-20110816/+build/2688939

Details about the rebuild:
http://people.ubuntuwire.org/~wgrant/rebuild-ftbfs-test/test-rebuild-20110816-oneiric.html

Direct link to the build log: https://launchpad.net/ubuntu/+archive/test-rebuild-20110816/+build/2688939/+files/buildlog_ubuntu-oneiric-i386.autogen_1%3A5.12-0.1ubuntu1_FAILEDTOBUILD.txt.gz

This log snippet might be of interest, since it triggered the matcher 'Purging chroot-autobuild'.
Excerpt 1395 lines into the build log:

PASS: vers.test
====================================================
1 of 22 tests failed
Please report to <email address hidden>
====================================================
make[4]: *** [check-TESTS] Error 1
make[4]: Leaving directory `/build/buildd/autogen-5.12/autoopts/test'
make[3]: *** [check-am] Error 2
make[3]: Leaving directory `/build/buildd/autogen-5.12/autoopts/test'
make[2]: *** [check-recursive] Error 1
make[2]: Leaving directory `/build/buildd/autogen-5.12/autoopts'
make[1]: *** [check-recursive] Error 1
make[1]: Leaving directory `/build/buildd/autogen-5.12'
make: *** [build-stamp] Error 2
dpkg-buildpackage: error: debian/rules build gave error exit status 2
******************************************************************************
Build finished at 20110818-1247
FAILED [dpkg-buildpackage died]
Purging chroot-autobuild/build/buildd/autogen-5.12

Matthias Klose (doko) on 2011-08-19
Changed in autogen (Ubuntu):
milestone: none → ubuntu-11.10-beta-1
status: New → Confirmed
importance: Undecided → High
Colin Watson (cjwatson) wrote :

I don't seem to be able to reproduce this in pbuilder. Does anyone have a way to reproduce this?

Matthias Klose (doko) wrote :

this seems to be an issue with the virtualized buildds; see bug #829253
seen with the libatomic-ops package too.

Martin Pitt (pitti) on 2011-08-31
Changed in autogen (Ubuntu):
milestone: ubuntu-11.10-beta-1 → ubuntu-11.10-beta-2
tags: added: rls-mgr-o-tracking
Colin Watson (cjwatson) wrote :

Unmilestoning, since this seems to be specific to the test rebuild.

Changed in autogen (Ubuntu Oneiric):
milestone: ubuntu-11.10-beta-2 → none
tags: removed: rls-mgr-o-tracking
Rolf Leggewie (r0lf) wrote :

oneiric has seen the end of its life and is no longer receiving any updates. Marking the oneiric task for this ticket as "Won't Fix".

Changed in autogen (Ubuntu Oneiric):
status: Confirmed → Won't Fix
Matthias Klose (doko) wrote :

closing an old ftbfs issue

Changed in autogen (Ubuntu):
status: Confirmed → Invalid
To post a comment you must log in.
This report contains Public information  Edit
Everyone can see this information.

Other bug subscribers