argyll 2.0.0+repack-1 doesn’t build

Bug #1745912 reported by AO
This bug affects 1 person
Affects Status Importance Assigned to Milestone
argyll (Ubuntu)

Bug Description

argyll 2.0.0+repack-1 which got uploaded in Bionic-proposed on 2017-12-03 has never built since.

tags: added: bionic ftbfs
Revision history for this message
Ross Gammon (rosco2) wrote :

A patch was applied in Debian to fix this build failure with GCC-10:

Changed in argyll (Ubuntu):
status: New → Confirmed
Revision history for this message
Ross Gammon (rosco2) wrote :

OK - 2.0.1+repack-1.1 is in proposed and builds on everything but the s390x architecture, even though it built fine in Debian on that architecture.

Tail of buildlog:
Install /<<BUILDDIR>>/argyll-2.0.1+repack/debian/tmp/usr/bin/viewgam
Cc_ xicc/cam02.o
Chmod1 gamut/GenRMGam
Chmod1 /<<BUILDDIR>>/argyll-2.0.1+repack/debian/tmp/usr/bin/viewgam
GenFile1 gamut/RefMediumGamut.gam
Cc_ xicc/mpp.o
Cc_ xicc/ccmx.o
Segmentation fault (core dumped)

  gamut/GenRMGam gamut/RefMediumGamut.gam

...failed GenFile1 gamut/RefMediumGamut.gam ...
...failed updating 1 target(s)...
...updated 65 target(s)...
make[1]: *** [debian/rules:28: override_dh_auto_install] Error 1
make[1]: Leaving directory '/<<BUILDDIR>>/argyll-2.0.1+repack'
make: *** [debian/rules:19: binary-arch] Error 2
dpkg-buildpackage: error: fakeroot debian/rules binary-arch subprocess returned exit status 2

To post a comment you must log in.
This report contains Public information  Edit
Everyone can see this information.

Other bug subscribers

Remote bug watches

Bug watches keep track of this bug in other bug trackers.