naming from ubuntu_k8s_unit_tests failed with Eoan-5.3 GCP

Bug #1855816 reported by Po-Hsu Lin on 2019-12-10
6
This bug affects 1 person
Affects Status Importance Assigned to Milestone
ubuntu-kernel-tests
Undecided
Unassigned
linux-gcp (Ubuntu)
Undecided
Unassigned

Bug Description

Issue found on 5.3.0-1010 Eoan GCP

 --- FAIL: TestGetNameFromCallsite (0.00s)
 --- FAIL: TestGetNameFromCallsite/ignore-package (0.00s)
 from_stack_test.go:52: expected "testing/testing.go:777", got "testing/testing.go:865"
 --- FAIL: TestGetNameFromCallsite/ignore-file (0.00s)
 from_stack_test.go:52: expected "testing/testing.go:777", got "testing/testing.go:865"
 FAIL
 FAIL k8s.io/kubernetes/vendor/k8s.io/apimachinery/pkg/util/naming 0.002s

This is not a regression as this failure can be found in 5.3.0-1009.10-gcp as well.

Po-Hsu Lin (cypressyew) on 2019-12-10
tags: added: 5.3 amd64 eoan gcp sru-20191202 ubuntu-k8s-unit-tests
Po-Hsu Lin (cypressyew) on 2019-12-10
description: updated
To post a comment you must log in.
This report contains Public information  Edit
Everyone can see this information.

Other bug subscribers