Exception raised from file "tempest/common/waiters.py", during cinder tests

Bug #1800079 reported by Anandprakash on 2018-10-26
6
This bug affects 1 person
Affects Status Importance Assigned to Milestone
tempest
Undecided
Unassigned

Bug Description

Exception raised from file "tempest/common/waiters.py", during cinder tests.

Logs-
setUpClass (tempest.api.volume.admin.test_volumes_actions.VolumesActionsV1Test)
Reason: _StringException: Traceback (most recent call last):
  File "tempest/test.py", line 248, in setUpClass
    six.reraise(etype, value, trace)
  File "tempest/test.py", line 241, in setUpClass
    cls.resource_setup()
  File "tempest/api/volume/admin/test_volumes_actions.py", line 43, in resource_setup
    cls.volume['id'], 'available')
  File "tempest/common/waiters.py", line 180, in wait_for_volume_status
    raise exceptions.VolumeBuildErrorException(volume_id=volume_id)
tempest.exceptions.VolumeBuildErrorException: Volume 47102a0f-1715-4356-b690-603ddcc9d24d failed to build and is in ERROR status

Traceback (most recent call last):
  File "tempest/api/volume/test_volumes_extend.py", line 31, in test_volume_extend
    self.volume = self.create_volume()
  File "tempest/api/volume/base.py", line 125, in create_volume
    volume['id'], 'available')
  File "tempest/common/waiters.py", line 180, in wait_for_volume_status
    raise exceptions.VolumeBuildErrorException(volume_id=volume_id)
tempest.exceptions.VolumeBuildErrorException: Volume bcb7edcb-efe8-4ffd-b5be-c0d4ff617bf1 failed to build and is in ERROR status

This issue seems to be environmental or devstack as backend may be down during installation.

Could you please provide the detail of :
cinder get-pools

If backend is not active, then please share cinder volume logs.

To post a comment you must log in.
This report contains Public information  Edit
Everyone can see this information.

Other bug subscribers