Jenkins tests and gates failing

Bug #1287863 reported by BK Box on 2014-03-04
This bug affects 1 person
Affects Status Importance Assigned to Milestone
BK Box

Bug Description

Initial code now being tested by Jenkins in Stackforge is failing tests:

    Patch Set 1: Doesn't seem to work
    Build failed. For information on how to proceed, see
    gate-satori-pep8 FAILURE in 50s
    gate-satori-docs SUCCESS in 1m 02s
    gate-satori-python26 FAILURE in 1m 19s
    gate-satori-python27 SUCCESS in 1m 25s
    gate-satori-python33 FAILURE in 3m 05s

BK Box (bkbox) wrote :

This has now been resolved and commited.

Changed in satori:
status: New → Fix Committed
Changed in satori:
milestone: none → poc
status: Fix Committed → Fix Released
To post a comment you must log in.
This report contains Public information  Edit
Everyone can see this information.

Other bug subscribers