Building netdude failure

Bug #313879 reported by dirdival on 2009-01-04
2
Affects Status Importance Assigned to Milestone
PLD Linux
Undecided
Unassigned

Bug Description

Hi,

make[3]: Entering directory `/home/users/dirdival/rpm/BUILD/netdude-0.3.3/protocols/fddi'
/bin/sh ../../libtool --tag=CC --mode=compile i686-pld-linux-gcc -DHAVE_CONFIG_H -I. -I../.. -I/usr/include/gtk-1.2
In file included from /usr/include/netinet/if_fddi.h:26,
                 from nd_fddi.h:29,
                 from nd_fddi.c:34:
/usr/include/linux/if_fddi.h:88: error: syntax error before "__be16"
/usr/include/linux/if_fddi.h:101: error: field `llc_snap' has incomplete type
make[3]: *** [nd_fddi.lo] Error 1
make[3]: Leaving directory `/home/users/dirdival/rpm/BUILD/netdude-0.3.3/protocols/fddi'
make[2]: *** [all-recursive] Error 1
make[2]: Leaving directory `/home/users/dirdival/rpm/BUILD/netdude-0.3.3/protocols'

[dirdival@pld ~]$ rpm -qf /usr/include/linux/if_fddi.h
linux-libc-headers-2.6.22.19-1

I have the newest version of this package. I add full builder output.

Ac,
gcc (GCC) 3.3.6 (PLD Linux)

Regards,
Krzysztof Goliński

Tags: ac Edit Tag help
dirdival (krzysztof-golinski) wrote :
To post a comment you must log in.
This report contains Public information  Edit
Everyone can see this information.

Other bug subscribers

Bug attachments