fails to build on i386, sqlite test fails

Bug #406433 reported by Thomas Koch
This bug affects 1 person
Affects Status Importance Assigned to Milestone
Gearman Packaging

Bug Description

works on amd64, i386 build logs show:

diff ../tests/sqlite_test.rec sqlite_test.res
< Testing add [ ok ]
< Testing worker [ ok ]
> Testing add [ failed ]
> Testing worker [ failed ]
make[2]: *** [check] Error 1
make[2]: Leaving directory `/tmp/buildd/gearmand-0.9/tests'
make[1]: *** [check-recursive] Error 1
make[1]: Leaving directory `/tmp/buildd/gearmand-0.9'
dh_auto_test: command returned error code 512
make: *** [build] Error 1
dpkg-buildpackage: failure: debian/rules build gave error exit status 2
pbuilder: Failed autobuilding of package
W: no hooks of type C found -- ignoring

description: updated
To post a comment you must log in.
This report contains Public information  
Everyone can see this information.

Other bug subscribers

Remote bug watches

Bug watches keep track of this bug in other bug trackers.