Percona XtraDB Storage Engine for MySQL

patching fails on 5.1.35

Reported by Aleksandr Kuzminsky on 2009-06-18
6
This bug affects 1 person
Affects Status Importance Assigned to Milestone
Percona-XtraDB
Fix Released
Medium
Aleksandr Kuzminsky

Bug Description

patching file mysql-test/r/mysqlbinlog_row_big.result
Hunk #2 FAILED at 12.
Hunk #3 succeeded at 100 with fuzz 2 (offset 28 lines).
1 out of 3 hunks FAILED -- saving rejects to file mysql-test/r/mysqlbinlog_row_big.result.rej
patching file mysql-test/t/mysqlbinlog_row_big.test
Hunk #2 FAILED at 46.
Hunk #3 succeeded at 149 with fuzz 1 (offset 22 lines).
1 out of 3 hunks FAILED -- saving rejects to file mysql-test/t/mysqlbinlog_row_big.test.rej

Changed in percona-xtradb:
assignee: nobody → Aleksandr Kuzminsky (akuzminsky)
Changed in percona-xtradb:
importance: Undecided → Medium
Vadim Tkachenko (vadim-tk) wrote :

Still can't apply mysql-test
...

applying mysql-test.diff
unable to find 'mysql-test/patches/events_stress.diff' for patching
1 out of 1 hunks FAILED -- saving rejects to file mysql-test/patches/events_stress.diff.rej
unable to find 'mysql-test/patches/information_schema_db.diff' for patching
1 out of 1 hunks FAILED -- saving rejects to file mysql-test/patches/information_schema_db.diff.rej
unable to find 'mysql-test/patches/innodb-analyze.diff' for patching
1 out of 1 hunks FAILED -- saving rejects to file mysql-test/patches/innodb-analyze.diff.rej
unable to find 'mysql-test/patches/innodb.diff' for patching
1 out of 1 hunks FAILED -- saving rejects to file mysql-test/patches/innodb.diff.rej
unable to find 'mysql-test/patches/mysqlshow.diff' for patching
1 out of 1 hunks FAILED -- saving rejects to file mysql-test/patches/mysqlshow.diff.rej
patch failed, unable to continue (try -v)

Changed in percona-xtradb:
status: New → Fix Committed
Changed in percona-xtradb:
status: Fix Committed → Fix Released
To post a comment you must log in.
This report contains Public information  Edit
Everyone can see this information.

Other bug subscribers