Debug build is broken due to compile time assert in

Bug #673562 reported by Alexey Kopytov on 2010-11-10
This bug affects 1 person
Affects Status Importance Assigned to Milestone
Percona Server
Alexey Kopytov

Bug Description

I'm getting the following when trying to make a debug build with BUILD/compile-pentium-debug-max-no-ndb In function 'int init_common_variables(const char*, int, char**, const char**)': error: size of array 'compile_time_assert' is negative
make[2]: *** [mysqld.o] Error 1
make[2]: Target `all-am' not remade because of errors.
make[1]: *** [all-recursive] Error 1
make: *** [all] Error 2

Compilation exited abnormally with code 2 at Wed Nov 10 18:20:59

Related branches

Yasufumi Kinoshita (community): Approve on 2010-11-26
Yasufumi Kinoshita (community): Needs Fixing on 2010-11-26
Percona: Approve on 2010-11-25
Alexey Kopytov (akopytov) wrote :

Can be repeated even without using the BUILD/* scripts. Just configure with --with-debug=full.

Percona (percona-team) on 2010-11-14
Changed in percona-server:
status: New → Triaged
importance: Undecided → High
assignee: nobody → Alexey Kopytov (akopytov)
Changed in percona-server:
status: Triaged → Fix Committed
Changed in percona-server:
status: Fix Committed → Fix Released
To post a comment you must log in.
This report contains Public information  Edit
Everyone can see this information.

Other bug subscribers