5.5 fails to compile with debug on Ubuntu Utopic

Bug #1396358 reported by George Ormond Lorch III on 2014-11-25
6
This bug affects 1 person
Affects Status Importance Assigned to Milestone
MySQL Server
Unknown
Unknown
Percona Server moved to https://jira.percona.com/projects/PS
Invalid
Undecided
Unassigned
5.5
Fix Released
High
George Ormond Lorch III
5.6
Invalid
Undecided
Unassigned

Bug Description

cmake . -DCMAKE_BUILD_TYPE=Debug -DWITH_DEBUG=ON -DMYSQL_MAINTAINER_MODE=ON -DBUILD_CONFIG=mysql_release -DFEATURE_SET=community -DWITH_EMBEDDED_SERVER=OFF -DENABLE_DTRACE=OFF -DWITH_EXAMPLE_STORAGE_ENGINE=1 -DWITH_SSL=system && make -j2
-- Running cmake version 2.8.12.2
-- Looking for sys/types.h
-- Looking for sys/types.h - found
-- Looking for stdint.h
-- Looking for stdint.h - found
-- Looking for stddef.h
-- Looking for stddef.h - found
-- Check size of void *
-- Check size of void * - done
-- Looking for include file libaio.h
-- Looking for include file libaio.h - found
-- Looking for io_queue_init in aio
-- Looking for io_queue_init in aio - found
-- Looking for SHM_HUGETLB
-- Looking for SHM_HUGETLB - found
-- Performing Test HAVE_DECLARATION_AFTER_STATEMENT
-- Performing Test HAVE_DECLARATION_AFTER_STATEMENT - Success
-- MySQL 5.5.39-36.0
-- Packaging as: mysql-5.5.39-36.0-Linux-i686
-- Looking for floor
-- Looking for floor - not found
-- Looking for floor in m
-- Looking for floor in m - found
-- Looking for gethostbyname_r
-- Looking for gethostbyname_r - found
-- Looking for bind
-- Looking for bind - found
-- Looking for crypt
-- Looking for crypt - not found
-- Looking for crypt in crypt
-- Looking for crypt in crypt - found
-- Looking for setsockopt
-- Looking for setsockopt - found
-- Looking for dlopen
-- Looking for dlopen - not found
-- Looking for dlopen in dl
-- Looking for dlopen in dl - found
-- Looking for sched_yield
-- Looking for sched_yield - found
-- Looking for clock_gettime
-- Looking for clock_gettime - found
-- Looking for include file pthread.h
-- Looking for include file pthread.h - found
-- Looking for pthread_create
-- Looking for pthread_create - not found
-- Looking for pthread_create in pthreads
-- Looking for pthread_create in pthreads - not found
-- Looking for pthread_create in pthread
-- Looking for pthread_create in pthread - found
-- Found Threads: TRUE
-- Looking for 4 include files stdlib.h, ..., float.h
-- Looking for 4 include files stdlib.h, ..., float.h - found
-- Looking for include file alloca.h
-- Looking for include file alloca.h - found
-- Looking for include file aio.h
-- Looking for include file aio.h - found
-- Looking for include file arpa/inet.h
-- Looking for include file arpa/inet.h - found
-- Looking for include file crypt.h
-- Looking for include file crypt.h - found
-- Looking for include file cxxabi.h
-- Looking for include file cxxabi.h - not found
-- Looking for include file dirent.h
-- Looking for include file dirent.h - found
-- Looking for include file dlfcn.h
-- Looking for include file dlfcn.h - found
-- Looking for include file execinfo.h
-- Looking for include file execinfo.h - found
-- Looking for include file fcntl.h
-- Looking for include file fcntl.h - found
-- Looking for include file fenv.h
-- Looking for include file fenv.h - found
-- Looking for include file float.h
-- Looking for include file float.h - found
-- Looking for include file floatingpoint.h
-- Looking for include file floatingpoint.h - not found
-- Looking for include file fpu_control.h
-- Looking for include file fpu_control.h - found
-- Looking for include file grp.h
-- Looking for include file grp.h - found
-- Looking for include file ieeefp.h
-- Looking for include file ieeefp.h - not found
-- Looking for include file inttypes.h
-- Looking for include file inttypes.h - found
-- Looking for include file langinfo.h
-- Looking for include file langinfo.h - found
-- Looking for include file limits.h
-- Looking for include file limits.h - found
-- Looking for include file locale.h
-- Looking for include file locale.h - found
-- Looking for include file malloc.h
-- Looking for include file malloc.h - found
-- Looking for include file memory.h
-- Looking for include file memory.h - found
-- Looking for include file ndir.h
-- Looking for include file ndir.h - not found
-- Looking for include file netinet/in.h
-- Looking for include file netinet/in.h - found
-- Looking for include file paths.h
-- Looking for include file paths.h - found
-- Looking for include file port.h
-- Looking for include file port.h - not found
-- Looking for include file poll.h
-- Looking for include file poll.h - found
-- Looking for include file pwd.h
-- Looking for include file pwd.h - found
-- Looking for include file sched.h
-- Looking for include file sched.h - found
-- Looking for include file select.h
-- Looking for include file select.h - not found
-- Looking for include file semaphore.h
-- Looking for include file semaphore.h - found
-- Looking for include files sys/types.h, sys/dir.h
-- Looking for include files sys/types.h, sys/dir.h - found
-- Looking for include file sys/ndir.h
-- Looking for include file sys/ndir.h - not found
-- Looking for include file sys/pte.h
-- Looking for include file sys/pte.h - not found
-- Looking for include file stdlib.h
-- Looking for include file stdlib.h - found
-- Looking for include file strings.h
-- Looking for include file strings.h - found
-- Looking for include file string.h
-- Looking for include file string.h - found
-- Looking for include file synch.h
-- Looking for include file synch.h - not found
-- Looking for include file sysent.h
-- Looking for include file sysent.h - not found
-- Looking for include file sys/cdefs.h
-- Looking for include file sys/cdefs.h - found
-- Looking for include file sys/file.h
-- Looking for include file sys/file.h - found
-- Looking for include file sys/fpu.h
-- Looking for include file sys/fpu.h - not found
-- Looking for include file sys/ioctl.h
-- Looking for include file sys/ioctl.h - found
-- Looking for include file sys/ipc.h
-- Looking for include file sys/ipc.h - found
-- Looking for include file sys/malloc.h
-- Looking for include file sys/malloc.h - not found
-- Looking for include file sys/mman.h
-- Looking for include file sys/mman.h - found
-- Looking for include file sys/prctl.h
-- Looking for include file sys/prctl.h - found
-- Looking for include file sys/resource.h
-- Looking for include file sys/resource.h - found
-- Looking for include file sys/select.h
-- Looking for include file sys/select.h - found
-- Looking for include file sys/shm.h
-- Looking for include file sys/shm.h - found
-- Looking for include file sys/socket.h
-- Looking for include file sys/socket.h - found
-- Looking for include file sys/stat.h
-- Looking for include file sys/stat.h - found
-- Looking for include file sys/stream.h
-- Looking for include file sys/stream.h - not found
-- Looking for include file sys/termcap.h
-- Looking for include file sys/termcap.h - not found
-- Looking for include files time.h, sys/timeb.h
-- Looking for include files time.h, sys/timeb.h - found
-- Looking for include files curses.h, term.h
-- Looking for include files curses.h, term.h - found
-- Looking for include file asm/termbits.h
-- Looking for include file asm/termbits.h - found
-- Looking for include file termbits.h
-- Looking for include file termbits.h - not found
-- Looking for include file termios.h
-- Looking for include file termios.h - found
-- Looking for include file termio.h
-- Looking for include file termio.h - found
-- Looking for include file termcap.h
-- Looking for include file termcap.h - found
-- Looking for include file unistd.h
-- Looking for include file unistd.h - found
-- Looking for include file utime.h
-- Looking for include file utime.h - found
-- Looking for include file varargs.h
-- Looking for include file varargs.h - not found
-- Looking for include file sys/time.h
-- Looking for include file sys/time.h - found
-- Looking for include file sys/utime.h
-- Looking for include file sys/utime.h - not found
-- Looking for include file sys/wait.h
-- Looking for include file sys/wait.h - found
-- Looking for include file sys/param.h
-- Looking for include file sys/param.h - found
-- Looking for include file sys/vadvise.h
-- Looking for include file sys/vadvise.h - not found
-- Looking for include file fnmatch.h
-- Looking for include file fnmatch.h - found
-- Looking for include file stdarg.h
-- Looking for include file stdarg.h - found
-- Looking for include files stdlib.h, sys/un.h
-- Looking for include files stdlib.h, sys/un.h - found
-- Looking for include file vis.h
-- Looking for include file vis.h - not found
-- Looking for include file wchar.h
-- Looking for include file wchar.h - found
-- Looking for include file wctype.h
-- Looking for include file wctype.h - found
-- Looking for include file sys/ptem.h
-- Looking for include file sys/ptem.h - not found
-- Performing Test HAVE_WERROR_FLAG
-- Performing Test HAVE_WERROR_FLAG - Success
-- Performing Test HAVE_PTHREAD_ONCE_INIT
-- Performing Test HAVE_PTHREAD_ONCE_INIT - Success
-- Looking for aio_read
-- Looking for aio_read - not found
-- Looking for alarm
-- Looking for alarm - found
-- Looking for backtrace
-- Looking for backtrace - found
-- Looking for backtrace_symbols
-- Looking for backtrace_symbols - found
-- Looking for backtrace_symbols_fd
-- Looking for backtrace_symbols_fd - found
-- Looking for printstack
-- Looking for printstack - not found
-- Looking for bfill
-- Looking for bfill - not found
-- Looking for bmove
-- Looking for bmove - not found
-- Looking for bsearch
-- Looking for bsearch - found
-- Looking for index
-- Looking for index - found
-- Looking for bzero
-- Looking for bzero - found
-- Looking for clock_gettime
-- Looking for clock_gettime - found
-- Looking for cuserid
-- Looking for cuserid - found
-- Looking for directio
-- Looking for directio - not found
-- Looking for _doprnt
-- Looking for _doprnt - not found
-- Looking for flockfile
-- Looking for flockfile - found
-- Looking for ftruncate
-- Looking for ftruncate - found
-- Looking for getline
-- Looking for getline - found
-- Looking for compress
-- Looking for compress - not found
-- Looking for crypt
-- Looking for crypt - found
-- Looking for dlerror
-- Looking for dlerror - found
-- Looking for dlopen
-- Looking for dlopen - found
-- Looking for fchmod
-- Looking for fchmod - found
-- Looking for fcntl
-- Looking for fcntl - found
-- Looking for fconvert
-- Looking for fconvert - not found
-- Looking for fdatasync
-- Looking for fdatasync - found
-- Looking for fdatasync
-- Looking for fdatasync - found
-- Looking for fesetround
-- Looking for fesetround - found
-- Looking for fedisableexcept
-- Looking for fedisableexcept - found
-- Looking for fpsetmask
-- Looking for fpsetmask - not found
-- Looking for fseeko
-- Looking for fseeko - found
-- Looking for fsync
-- Looking for fsync - found
-- Looking for getcwd
-- Looking for getcwd - found
-- Looking for gethostbyaddr_r
-- Looking for gethostbyaddr_r - found
-- Looking for gethrtime
-- Looking for gethrtime - not found
-- Looking for getnameinfo
-- Looking for getnameinfo - found
-- Looking for getpass
-- Looking for getpass - found
-- Looking for getpassphrase
-- Looking for getpassphrase - not found
-- Looking for getpwnam
-- Looking for getpwnam - found
-- Looking for getpwuid
-- Looking for getpwuid - found
-- Looking for getrlimit
-- Looking for getrlimit - found
-- Looking for getrusage
-- Looking for getrusage - found
-- Looking for getwd
-- Looking for getwd - found
-- Looking for gmtime_r
-- Looking for gmtime_r - found
-- Looking for initgroups
-- Looking for initgroups - found
-- Looking for issetugid
-- Looking for issetugid - not found
-- Looking for getuid
-- Looking for getuid - found
-- Looking for geteuid
-- Looking for geteuid - found
-- Looking for getgid
-- Looking for getgid - found
-- Looking for getegid
-- Looking for getegid - found
-- Looking for ldiv
-- Looking for ldiv - found
-- Looking for localtime_r
-- Looking for localtime_r - found
-- Looking for longjmp
-- Looking for longjmp - found
-- Looking for lstat
-- Looking for lstat - found
-- Looking for madvise
-- Looking for madvise - found
-- Looking for mallinfo
-- Looking for mallinfo - found
-- Looking for memcpy
-- Looking for memcpy - found
-- Looking for memmove
-- Looking for memmove - found
-- Looking for mkstemp
-- Looking for mkstemp - found
-- Looking for mlock
-- Looking for mlock - found
-- Looking for mlockall
-- Looking for mlockall - found
-- Looking for mmap
-- Looking for mmap - found
-- Looking for mmap64
-- Looking for mmap64 - found
-- Looking for perror
-- Looking for perror - found
-- Looking for poll
-- Looking for poll - found
-- Looking for port_create
-- Looking for port_create - not found
-- Looking for posix_fallocate
-- Looking for posix_fallocate - found
-- Looking for pread
-- Looking for pread - found
-- Looking for pthread_attr_create
-- Looking for pthread_attr_create - not found
-- Looking for pthread_attr_getstacksize
-- Looking for pthread_attr_getstacksize - found
-- Looking for pthread_attr_setscope
-- Looking for pthread_attr_setscope - found
-- Looking for pthread_attr_setstacksize
-- Looking for pthread_attr_setstacksize - found
-- Looking for pthread_condattr_create
-- Looking for pthread_condattr_create - not found
-- Looking for pthread_condattr_setclock
-- Looking for pthread_condattr_setclock - found
-- Looking for pthread_key_delete
-- Looking for pthread_key_delete - found
-- Looking for pthread_rwlock_rdlock
-- Looking for pthread_rwlock_rdlock - found
-- Looking for pthread_sigmask
-- Looking for pthread_sigmask - found
-- Looking for pthread_threadmask
-- Looking for pthread_threadmask - not found
-- Looking for pthread_yield_np
-- Looking for pthread_yield_np - not found
-- Looking for putenv
-- Looking for putenv - found
-- Looking for readdir_r
-- Looking for readdir_r - found
-- Looking for readlink
-- Looking for readlink - found
-- Looking for re_comp
-- Looking for re_comp - found
-- Looking for regcomp
-- Looking for regcomp - found
-- Looking for realpath
-- Looking for realpath - found
-- Looking for rename
-- Looking for rename - found
-- Looking for rwlock_init
-- Looking for rwlock_init - not found
-- Looking for sched_yield
-- Looking for sched_yield - found
-- Looking for setenv
-- Looking for setenv - found
-- Looking for setlocale
-- Looking for setlocale - found
-- Looking for setfd
-- Looking for setfd - not found
-- Looking for sigaction
-- Looking for sigaction - found
-- Looking for sigthreadmask
-- Looking for sigthreadmask - not found
-- Looking for sigwait
-- Looking for sigwait - found
-- Looking for sigaddset
-- Looking for sigaddset - found
-- Looking for sigemptyset
-- Looking for sigemptyset - found
-- Looking for sighold
-- Looking for sighold - found
-- Looking for sigset
-- Looking for sigset - found
-- Looking for sleep
-- Looking for sleep - found
-- Looking for snprintf
-- Looking for snprintf - found
-- Looking for stpcpy
-- Looking for stpcpy - found
-- Looking for strcoll
-- Looking for strcoll - found
-- Looking for strerror
-- Looking for strerror - found
-- Looking for strlcpy
-- Looking for strlcpy - not found
-- Looking for strnlen
-- Looking for strnlen - found
-- Looking for strlcat
-- Looking for strlcat - not found
-- Looking for strsignal
-- Looking for strsignal - found
-- Looking for fgetln
-- Looking for fgetln - not found
-- Looking for strpbrk
-- Looking for strpbrk - found
-- Looking for strsep
-- Looking for strsep - found
-- Looking for strstr
-- Looking for strstr - found
-- Looking for strtok_r
-- Looking for strtok_r - found
-- Looking for strtol
-- Looking for strtol - found
-- Looking for strtoll
-- Looking for strtoll - found
-- Looking for strtoul
-- Looking for strtoul - found
-- Looking for strtoull
-- Looking for strtoull - found
-- Looking for strcasecmp
-- Looking for strcasecmp - found
-- Looking for strncasecmp
-- Looking for strncasecmp - found
-- Looking for strdup
-- Looking for strdup - found
-- Looking for shmat
-- Looking for shmat - found
-- Looking for shmctl
-- Looking for shmctl - found
-- Looking for shmdt
-- Looking for shmdt - found
-- Looking for shmget
-- Looking for shmget - found
-- Looking for tell
-- Looking for tell - not found
-- Looking for tempnam
-- Looking for tempnam - found
-- Looking for thr_setconcurrency
-- Looking for thr_setconcurrency - not found
-- Looking for thr_yield
-- Looking for thr_yield - not found
-- Looking for vasprintf
-- Looking for vasprintf - found
-- Looking for vsnprintf
-- Looking for vsnprintf - found
-- Looking for vprintf
-- Looking for vprintf - found
-- Looking for valloc
-- Looking for valloc - found
-- Looking for memalign
-- Looking for memalign - found
-- Looking for chown
-- Looking for chown - found
-- Looking for nl_langinfo
-- Looking for nl_langinfo - found
-- Looking for include file time.h
-- Looking for include file time.h - found
-- Looking for include file sys/times.h
-- Looking for include file sys/times.h - found
-- Looking for include file asm/msr.h
-- Looking for include file asm/msr.h - found
-- Looking for include file ia64intrin.h
-- Looking for include file ia64intrin.h - not found
-- Looking for times
-- Looking for times - found
-- Looking for gettimeofday
-- Looking for gettimeofday - found
-- Looking for read_real_time
-- Looking for read_real_time - not found
-- Looking for ftime
-- Looking for ftime - found
-- Looking for time
-- Looking for time - found
-- Looking for rdtscll
-- Looking for rdtscll - not found
-- Looking for sys_errlist
-- Looking for sys_errlist - found
-- Looking for madvise
-- Looking for madvise - found
-- Looking for tzname
-- Looking for tzname - found
-- Looking for lrand48
-- Looking for lrand48 - found
-- Looking for getpagesize
-- Looking for getpagesize - found
-- Looking for TIOCGWINSZ
-- Looking for TIOCGWINSZ - found
-- Looking for FIONREAD
-- Looking for FIONREAD - found
-- Looking for TIOCSTAT
-- Looking for TIOCSTAT - not found
-- Looking for FIONREAD
-- Looking for FIONREAD - not found
-- Looking for finite
-- Looking for finite - found
-- Looking for log2
-- Looking for log2 - found
-- Looking for isnan
-- Looking for isnan - found
-- Looking for rint
-- Looking for rint - found
-- Performing Test HAVE_ISINF
-- Performing Test HAVE_ISINF - Success
-- Check if the system is big endian
-- Searching 16 bit integer
-- Check size of unsigned short
-- Check size of unsigned short - done
-- Using unsigned short
-- Check if the system is big endian - little endian
-- Check size of sigset_t
-- Check size of sigset_t - done
-- Check size of mode_t
-- Check size of mode_t - done
-- Check size of char *
-- Check size of char * - done
-- Check size of long
-- Check size of long - done
-- Check size of size_t
-- Check size of size_t - done
-- Check size of char
-- Check size of char - done
-- Check size of short
-- Check size of short - done
-- Check size of int
-- Check size of int - done
-- Check size of long long
-- Check size of long long - done
-- Check size of off_t
-- Check size of off_t - done
-- Check size of uchar
-- Check size of uchar - failed
-- Check size of uint
-- Check size of uint - done
-- Check size of ulong
-- Check size of ulong - done
-- Check size of int8
-- Check size of int8 - failed
-- Check size of uint8
-- Check size of uint8 - failed
-- Check size of int16
-- Check size of int16 - failed
-- Check size of uint16
-- Check size of uint16 - failed
-- Check size of int32
-- Check size of int32 - failed
-- Check size of uint32
-- Check size of uint32 - failed
-- Check size of u_int32_t
-- Check size of u_int32_t - done
-- Check size of int64
-- Check size of int64 - failed
-- Check size of uint64
-- Check size of uint64 - failed
-- Check size of time_t
-- Check size of time_t - done
-- Check size of bool
-- Check size of bool - failed
-- Check size of socklen_t
-- Check size of socklen_t - done
-- Performing Test TIME_T_UNSIGNED
-- Performing Test TIME_T_UNSIGNED - Failed
-- Performing Test HAVE_GETADDRINFO
-- Performing Test HAVE_GETADDRINFO - Success
-- Performing Test HAVE_SELECT
-- Performing Test HAVE_SELECT - Success
-- Performing Test HAVE_TIMESPEC_TS_SEC
-- Performing Test HAVE_TIMESPEC_TS_SEC - Failed
-- Performing Test QSORT_TYPE_IS_VOID
-- Performing Test QSORT_TYPE_IS_VOID - Success
-- Performing Test HAVE_SOCKET_SIZE_T_AS_socklen_t
-- Performing Test HAVE_SOCKET_SIZE_T_AS_socklen_t - Success
-- Performing Test HAVE_PTHREAD_YIELD_ZERO_ARG
-- Performing Test HAVE_PTHREAD_YIELD_ZERO_ARG - Success
-- Checking stack direction : -1
-- Performing Test SIGNAL_RETURN_TYPE_IS_VOID
-- Performing Test SIGNAL_RETURN_TYPE_IS_VOID - Success
-- Looking for include files time.h, sys/time.h
-- Looking for include files time.h, sys/time.h - found
-- Looking for O_NONBLOCK
-- Looking for O_NONBLOCK - found
-- Performing Test C_HAS_inline
-- Performing Test C_HAS_inline - Success
-- Performing Test HAVE_PAUSE_INSTRUCTION
-- Performing Test HAVE_PAUSE_INSTRUCTION - Success
-- Looking for tcgetattr
-- Looking for tcgetattr - found
-- Performing Test HAVE_POSIX_SIGNALS
-- Performing Test HAVE_POSIX_SIGNALS - Success
-- Performing Test HAVE_BSS_START
-- Performing Test HAVE_BSS_START - Success
-- Performing Test HAVE_WEAK_SYMBOL
-- Performing Test HAVE_WEAK_SYMBOL - Success
-- Performing Test HAVE_CXX_NEW
-- Performing Test HAVE_CXX_NEW - Success
-- Performing Test HAVE_SOLARIS_STYLE_GETHOST
-- Performing Test HAVE_SOLARIS_STYLE_GETHOST - Failed
-- Performing Test HAVE_SOCKET_TIMEOUT
-- Performing Test HAVE_SOCKET_TIMEOUT - Success
-- Performing Test HAVE_GCC_ATOMIC_BUILTINS
-- Performing Test HAVE_GCC_ATOMIC_BUILTINS - Success
-- Looking for netinet/in6.h
-- Looking for netinet/in6.h - not found
-- Check size of struct sockaddr_in6
-- Check size of struct sockaddr_in6 - done
-- Check size of struct in6_addr
-- Check size of struct in6_addr - done
-- Performing Test HAVE_SOCKADDR_STORAGE_SS_FAMILY
-- Performing Test HAVE_SOCKADDR_STORAGE_SS_FAMILY - Success
-- Performing Test HAVE_SOCKADDR_IN_SIN_LEN
-- Performing Test HAVE_SOCKADDR_IN_SIN_LEN - Failed
-- Performing Test HAVE_SOCKADDR_IN6_SIN6_LEN
-- Performing Test HAVE_SOCKADDR_IN6_SIN6_LEN - Failed
-- Performing Test STRUCT_DIRENT_HAS_D_INO
-- Performing Test STRUCT_DIRENT_HAS_D_INO - Success
-- Performing Test STRUCT_DIRENT_HAS_D_NAMLEN
-- Performing Test STRUCT_DIRENT_HAS_D_NAMLEN - Failed
-- Performing Test HAVE_VISIBILITY_HIDDEN
-- Performing Test HAVE_VISIBILITY_HIDDEN - Success
-- Found OpenSSL: /usr/lib/i386-linux-gnu/libssl.so;/usr/lib/i386-linux-gnu/libcrypto.so (found version "1.0.1f")
-- Looking for SHA512_DIGEST_LENGTH
-- Looking for SHA512_DIGEST_LENGTH - found
-- Check size of mbstate_t
-- Check size of mbstate_t - done
-- Performing Test HAVE_LANGINFO_CODESET
-- Performing Test HAVE_LANGINFO_CODESET - Success
-- Looking for mbrlen
-- Looking for mbrlen - found
-- Looking for mbscmp
-- Looking for mbscmp - not found
-- Looking for mbsrtowcs
-- Looking for mbsrtowcs - found
-- Looking for wcrtomb
-- Looking for wcrtomb - found
-- Looking for mbrtowc
-- Looking for mbrtowc - found
-- Looking for wcscoll
-- Looking for wcscoll - found
-- Looking for wcsdup
-- Looking for wcsdup - found
-- Looking for wcwidth
-- Looking for wcwidth - found
-- Looking for wctype
-- Looking for wctype - found
-- Looking for iswlower
-- Looking for iswlower - found
-- Looking for iswupper
-- Looking for iswupper - found
-- Looking for towlower
-- Looking for towlower - found
-- Looking for towupper
-- Looking for towupper - found
-- Looking for iswctype
-- Looking for iswctype - found
-- Check size of wchar_t
-- Check size of wchar_t - done
-- Check size of wctype_t
-- Check size of wctype_t - done
-- Check size of wint_t
-- Check size of wint_t - done
-- Found Curses: /usr/lib/i386-linux-gnu/libcurses.so
-- Looking for tputs in /usr/lib/i386-linux-gnu/libcurses.so
-- Looking for tputs in /usr/lib/i386-linux-gnu/libcurses.so - found
-- C warning options: -Wall -Wextra -Wunused -Wwrite-strings -Wno-strict-aliasing -Werror -Wdeclaration-after-statement
-- C++ warning options: -Wall -Wextra -Wunused -Wwrite-strings -Wno-strict-aliasing -Werror -Wno-unused-parameter -Woverloaded-virtual
-- Performing Test HAVE_IB_GCC_ATOMIC_BUILTINS
-- Performing Test HAVE_IB_GCC_ATOMIC_BUILTINS - Success
-- Performing Test HAVE_IB_GCC_ATOMIC_BUILTINS_64
-- Performing Test HAVE_IB_GCC_ATOMIC_BUILTINS_64 - Success
-- Performing Test HAVE_IB_ATOMIC_PTHREAD_T_GCC
-- Performing Test HAVE_IB_ATOMIC_PTHREAD_T_GCC - Success
-- Check size of pthread_t
-- Check size of pthread_t - done
-- Performing Test HAVE_PEERCRED
-- Performing Test HAVE_PEERCRED - Success
-- Library perconaserverclient depends on OSLIBS -lpthread;m;/usr/lib/i386-linux-gnu/libssl.so;/usr/lib/i386-linux-gnu/libcrypto.so;dl
-- Configuring done
-- Generating done
-- Build files have been written to: /home/george/dev/percona/74987/5.5
-- Running cmake version 2.8.12.2
-- MySQL 5.5.39-36.0
-- Packaging as: mysql-5.5.39-36.0-Linux-i686
-- C warning options: -Wall -Wextra -Wunused -Wwrite-strings -Wno-strict-aliasing -Werror -Wdeclaration-after-statement
-- C++ warning options: -Wall -Wextra -Wunused -Wwrite-strings -Wno-strict-aliasing -Werror -Wno-unused-parameter -Woverloaded-virtual
-- Library perconaserverclient depends on OSLIBS -lpthread;m;/usr/lib/i386-linux-gnu/libssl.so;/usr/lib/i386-linux-gnu/libcrypto.so;dl
-- Configuring done
-- Generating done
-- Build files have been written to: /home/george/dev/percona/74987/5.5
Scanning dependencies of target INFO_BIN
Scanning dependencies of target INFO_SRC
[ 0%] Built target INFO_BIN
Scanning dependencies of target abi_check
[ 0%] Built target INFO_SRC
Scanning dependencies of target zlib
[ 0%] Building C object zlib/CMakeFiles/zlib.dir/adler32.c.o
[ 0%] Building C object zlib/CMakeFiles/zlib.dir/compress.c.o
[ 0%] Built target abi_check
[ 0%] Scanning dependencies of target readline
Building C object zlib/CMakeFiles/zlib.dir/crc32.c.o
[ 1%] Building C object cmd-line-utils/readline/CMakeFiles/readline.dir/readline.c.o
[ 1%] Building C object zlib/CMakeFiles/zlib.dir/deflate.c.o
[ 1%] Building C object cmd-line-utils/readline/CMakeFiles/readline.dir/funmap.c.o
[ 1%] Building C object cmd-line-utils/readline/CMakeFiles/readline.dir/keymaps.c.o
[ 1%] Building C object zlib/CMakeFiles/zlib.dir/gzio.c.o
[ 1%] Building C object cmd-line-utils/readline/CMakeFiles/readline.dir/vi_mode.c.o
[ 2%] Building C object zlib/CMakeFiles/zlib.dir/infback.c.o
[ 2%] Building C object zlib/CMakeFiles/zlib.dir/inffast.c.o
[ 2%] [ 2%] Building C object cmd-line-utils/readline/CMakeFiles/readline.dir/parens.c.o
Building C object zlib/CMakeFiles/zlib.dir/inflate.c.o
[ 2%] Building C object cmd-line-utils/readline/CMakeFiles/readline.dir/rltty.c.o
[ 3%] Building C object cmd-line-utils/readline/CMakeFiles/readline.dir/complete.c.o
[ 3%] Building C object zlib/CMakeFiles/zlib.dir/inftrees.c.o
[ 3%] Building C object zlib/CMakeFiles/zlib.dir/trees.c.o
[ 3%] Building C object cmd-line-utils/readline/CMakeFiles/readline.dir/bind.c.o
[ 3%] Building C object zlib/CMakeFiles/zlib.dir/uncompr.c.o
[ 4%] Building C object zlib/CMakeFiles/zlib.dir/zutil.c.o
Linking C static library libzlib.a
[ 4%] Built target zlib
Scanning dependencies of target strings
[ 4%] Building C object strings/CMakeFiles/strings.dir/bchange.c.o
[ 4%] Building C object strings/CMakeFiles/strings.dir/bmove_upp.c.o
[ 4%] Building C object cmd-line-utils/readline/CMakeFiles/readline.dir/isearch.c.o
[ 4%] Building C object strings/CMakeFiles/strings.dir/ctype-big5.c.o
[ 4%] Building C object cmd-line-utils/readline/CMakeFiles/readline.dir/display.c.o
[ 4%] Building C object strings/CMakeFiles/strings.dir/ctype-bin.c.o
[ 4%] Building C object strings/CMakeFiles/strings.dir/ctype-cp932.c.o
[ 4%] Building C object cmd-line-utils/readline/CMakeFiles/readline.dir/signals.c.o
[ 4%] Building C object cmd-line-utils/readline/CMakeFiles/readline.dir/util.c.o
[ 4%] Building C object cmd-line-utils/readline/CMakeFiles/readline.dir/kill.c.o
[ 5%] Building C object strings/CMakeFiles/strings.dir/ctype-czech.c.o
[ 6%] Building C object cmd-line-utils/readline/CMakeFiles/readline.dir/undo.c.o
[ 6%] Building C object cmd-line-utils/readline/CMakeFiles/readline.dir/macro.c.o
[ 6%] Building C object strings/CMakeFiles/strings.dir/ctype-euc_kr.c.o
[ 6%] Building C object cmd-line-utils/readline/CMakeFiles/readline.dir/input.c.o
[ 6%] Building C object cmd-line-utils/readline/CMakeFiles/readline.dir/callback.c.o
[ 6%] Building C object strings/CMakeFiles/strings.dir/ctype-eucjpms.c.o
[ 6%] Building C object cmd-line-utils/readline/CMakeFiles/readline.dir/terminal.c.o
[ 6%] Building C object cmd-line-utils/readline/CMakeFiles/readline.dir/xmalloc.c.o
[ 6%] Building C object cmd-line-utils/readline/CMakeFiles/readline.dir/history.c.o
[ 7%] Building C object cmd-line-utils/readline/CMakeFiles/readline.dir/histsearch.c.o
[ 7%] Building C object cmd-line-utils/readline/CMakeFiles/readline.dir/histexpand.c.o
[ 7%] Building C object strings/CMakeFiles/strings.dir/ctype-extra.c.o
[ 7%] Building C object cmd-line-utils/readline/CMakeFiles/readline.dir/histfile.c.o
[ 7%] Building C object cmd-line-utils/readline/CMakeFiles/readline.dir/nls.c.o
[ 7%] Building C object strings/CMakeFiles/strings.dir/ctype-gb2312.c.o
[ 7%] Building C object cmd-line-utils/readline/CMakeFiles/readline.dir/search.c.o
[ 7%] Building C object cmd-line-utils/readline/CMakeFiles/readline.dir/shell.c.o
[ 7%] Building C object strings/CMakeFiles/strings.dir/ctype-gbk.c.o
[ 7%] Building C object cmd-line-utils/readline/CMakeFiles/readline.dir/tilde.c.o
[ 8%] Building C object cmd-line-utils/readline/CMakeFiles/readline.dir/misc.c.o
[ 8%] Building C object cmd-line-utils/readline/CMakeFiles/readline.dir/text.c.o
[ 8%] Building C object strings/CMakeFiles/strings.dir/ctype-latin1.c.o
[ 9%] Building C object strings/CMakeFiles/strings.dir/ctype-mb.c.o
[ 9%] Building C object cmd-line-utils/readline/CMakeFiles/readline.dir/mbutil.c.o
[ 9%] Building C object cmd-line-utils/readline/CMakeFiles/readline.dir/compat.c.o
[ 9%] Building C object cmd-line-utils/readline/CMakeFiles/readline.dir/savestring.c.o
Linking C static library libreadline.a
[ 9%] [ 9%] Built target readline
Building C object strings/CMakeFiles/strings.dir/ctype-simple.c.o
Scanning dependencies of target mytap
[ 9%] Building C object unittest/mytap/CMakeFiles/mytap.dir/tap.c.o
Linking C static library libmytap.a
[ 9%] Built target mytap
[ 9%] Building C object libservices/CMakeFiles/mysqlservices.dir/my_snprintf_service.c.o
[ 9%] Building C object libservices/CMakeFiles/mysqlservices.dir/thd_alloc_service.c.o
[ 10%] Building C object libservices/CMakeFiles/mysqlservices.dir/thd_wait_service.c.o
[ 10%] Building C object libservices/CMakeFiles/mysqlservices.dir/my_thread_scheduler_service.c.o
Linking C static library libmysqlservices.a
[ 10%] Built target mysqlservices
Scanning dependencies of target vio
[ 10%] [ 10%] Building C object vio/CMakeFiles/vio.dir/vio.c.o
Building C object strings/CMakeFiles/strings.dir/ctype-sjis.c.o
[ 10%] Building C object vio/CMakeFiles/vio.dir/viosocket.c.o
[ 10%] Building C object strings/CMakeFiles/strings.dir/ctype-tis620.c.o
[ 11%] Building C object vio/CMakeFiles/vio.dir/viossl.c.o
[ 11%] Building C object strings/CMakeFiles/strings.dir/ctype-uca.c.o
[ 11%] Building C object vio/CMakeFiles/vio.dir/viosslfactories.c.o
Linking C static library libvio.a
[ 11%] Building C object strings/CMakeFiles/strings.dir/ctype-ucs2.c.o
[ 11%] Built target vio
Scanning dependencies of target regex
[ 11%] Building C object regex/CMakeFiles/regex.dir/regcomp.c.o
[ 12%] Building C object regex/CMakeFiles/regex.dir/regerror.c.o
[ 12%] Building C object regex/CMakeFiles/regex.dir/regexec.c.o
[ 13%] Building C object strings/CMakeFiles/strings.dir/ctype-ujis.c.o
[ 13%] Building C object regex/CMakeFiles/regex.dir/regfree.c.o
[ 13%] Building C object regex/CMakeFiles/regex.dir/reginit.c.o
Linking C static library libregex.a
[ 13%] Built target regex
Scanning dependencies of target gen_lex_hash
[ 13%] Building CXX object sql/CMakeFiles/gen_lex_hash.dir/gen_lex_hash.cc.o
[ 13%] Building C object strings/CMakeFiles/strings.dir/ctype-utf8.c.o
Linking CXX executable gen_lex_hash
[ 13%] Built target gen_lex_hash
Scanning dependencies of target innochecksum
[ 14%] Building C object extra/CMakeFiles/innochecksum.dir/innochecksum.c.o
[ 14%] Linking C executable innochecksum
Building C object strings/CMakeFiles/strings.dir/ctype-win1250ch.c.o
[ 14%] Built target innochecksum
[ 14%] Building C object scripts/CMakeFiles/comp_sql.dir/comp_sql.c.o
Linking C executable comp_sql
[ 14%] Built target comp_sql
[ 14%] Building C object strings/CMakeFiles/strings.dir/ctype.c.o
[ 14%] Building CXX object mysql-test/lib/My/SafeProcess/CMakeFiles/my_safe_process.dir/safe_process.cc.o
[ 14%] Building C object strings/CMakeFiles/strings.dir/decimal.c.o
Linking CXX executable my_safe_process
[ 14%] Built target my_safe_process
Scanning dependencies of target GenServerSource
[ 14%] Generating lex_hash.h
[ 14%] Built target GenServerSource
[ 14%] Generating mysql_fix_privilege_tables_sql.c
[ 14%] Built target GenFixPrivs
[ 14%] Building C object strings/CMakeFiles/strings.dir/dtoa.c.o
[ 14%] Building C object strings/CMakeFiles/strings.dir/int2str.c.o
[ 15%] Building C object strings/CMakeFiles/strings.dir/is_prefix.c.o
[ 15%] Building C object strings/CMakeFiles/strings.dir/llstr.c.o
[ 15%] Building C object strings/CMakeFiles/strings.dir/longlong2str.c.o
[ 15%] Building C object strings/CMakeFiles/strings.dir/my_strtoll10.c.o
[ 15%] Building C object strings/CMakeFiles/strings.dir/my_vsnprintf.c.o
[ 15%] Building C object strings/CMakeFiles/strings.dir/str2int.c.o
[ 15%] Building C object strings/CMakeFiles/strings.dir/str_alloc.c.o
[ 16%] Building C object strings/CMakeFiles/strings.dir/strcend.c.o
[ 16%] Building C object strings/CMakeFiles/strings.dir/strend.c.o
[ 16%] [ 16%] Building C object strings/CMakeFiles/strings.dir/strmake.c.o
Building C object strings/CMakeFiles/strings.dir/strfill.c.o
[ 16%] Building C object strings/CMakeFiles/strings.dir/strmov.c.o
[ 16%] Building C object strings/CMakeFiles/strings.dir/strnmov.c.o
[ 16%] Building C object strings/CMakeFiles/strings.dir/strxmov.c.o
[ 17%] [ 17%] Building C object strings/CMakeFiles/strings.dir/xml.c.o
Building C object strings/CMakeFiles/strings.dir/strxnmov.c.o
[ 17%] Building C object strings/CMakeFiles/strings.dir/my_strchr.c.o
[ 17%] Building C object strings/CMakeFiles/strings.dir/strcont.c.o
[ 17%] Building C object strings/CMakeFiles/strings.dir/strappend.c.o
Linking C static library libstrings.a
[ 17%] Built target strings
Scanning dependencies of target mysys
[ 17%] [ 17%] Building C object mysys/CMakeFiles/mysys.dir/array.c.o
Building C object mysys/CMakeFiles/mysys.dir/charset-def.c.o
[ 18%] Building C object mysys/CMakeFiles/mysys.dir/charset.c.o
[ 18%] Building C object mysys/CMakeFiles/mysys.dir/checksum.c.o
[ 18%] Building C object mysys/CMakeFiles/mysys.dir/default.c.o
[ 18%] Building C object mysys/CMakeFiles/mysys.dir/errors.c.o
[ 18%] Building C object mysys/CMakeFiles/mysys.dir/hash.c.o
[ 18%] Building C object mysys/CMakeFiles/mysys.dir/list.c.o
[ 18%] Building C object mysys/CMakeFiles/mysys.dir/md5.c.o
[ 19%] Building C object mysys/CMakeFiles/mysys.dir/mf_cache.c.o
[ 19%] Building C object mysys/CMakeFiles/mysys.dir/mf_dirname.c.o
[ 19%] Building C object mysys/CMakeFiles/mysys.dir/mf_fn_ext.c.o
[ 19%] [ 19%] Building C object mysys/CMakeFiles/mysys.dir/mf_format.c.o
Building C object mysys/CMakeFiles/mysys.dir/mf_getdate.c.o
[ 19%] Building C object mysys/CMakeFiles/mysys.dir/mf_iocache.c.o
[ 19%] Building C object mysys/CMakeFiles/mysys.dir/mf_iocache2.c.o
[ 20%] Building C object mysys/CMakeFiles/mysys.dir/mf_keycache.c.o
[ 20%] Building C object mysys/CMakeFiles/mysys.dir/mf_keycaches.c.o
[ 20%] Building C object mysys/CMakeFiles/mysys.dir/mf_loadpath.c.o
[ 20%] Building C object mysys/CMakeFiles/mysys.dir/mf_pack.c.o
[ 20%] Building C object mysys/CMakeFiles/mysys.dir/mf_path.c.o
[ 20%] Building C object mysys/CMakeFiles/mysys.dir/mf_qsort.c.o
[ 21%] Building C object mysys/CMakeFiles/mysys.dir/mf_qsort2.c.o
[ 21%] Building C object mysys/CMakeFiles/mysys.dir/mf_radix.c.o
[ 21%] Building C object mysys/CMakeFiles/mysys.dir/mf_same.c.o
[ 21%] Building C object mysys/CMakeFiles/mysys.dir/mf_sort.c.o
[ 21%] Building C object mysys/CMakeFiles/mysys.dir/mf_soundex.c.o
[ 21%] Building C object mysys/CMakeFiles/mysys.dir/mf_arr_appstr.c.o
[ 21%] Building C object mysys/CMakeFiles/mysys.dir/mf_tempdir.c.o
[ 22%] Building C object mysys/CMakeFiles/mysys.dir/mf_tempfile.c.o
[ 22%] Building C object mysys/CMakeFiles/mysys.dir/mf_unixpath.c.o
[ 22%] Building C object mysys/CMakeFiles/mysys.dir/mf_wcomp.c.o
[ 22%] Building C object mysys/CMakeFiles/mysys.dir/mulalloc.c.o
[ 22%] Building C object mysys/CMakeFiles/mysys.dir/my_access.c.o
[ 22%] Building C object mysys/CMakeFiles/mysys.dir/my_aes.c.o
[ 22%] Building C object mysys/CMakeFiles/mysys.dir/my_alloc.c.o
[ 23%] Building C object mysys/CMakeFiles/mysys.dir/my_bit.c.o
[ 23%] [ 23%] Building C object mysys/CMakeFiles/mysys.dir/my_bitmap.c.o
Building C object mysys/CMakeFiles/mysys.dir/my_chsize.c.o
[ 23%] Building C object mysys/CMakeFiles/mysys.dir/my_compress.c.o
[ 23%] Building C object mysys/CMakeFiles/mysys.dir/my_copy.c.o
[ 23%] Building C object mysys/CMakeFiles/mysys.dir/my_create.c.o
[ 23%] Building C object mysys/CMakeFiles/mysys.dir/my_delete.c.o
[ 24%] Building C object mysys/CMakeFiles/mysys.dir/my_div.c.o
[ 24%] Building C object mysys/CMakeFiles/mysys.dir/my_error.c.o
[ 24%] Building C object mysys/CMakeFiles/mysys.dir/my_file.c.o
[ 24%] [ 24%] Building C object mysys/CMakeFiles/mysys.dir/my_fopen.c.o
Building C object mysys/CMakeFiles/mysys.dir/my_fstream.c.o
[ 24%] Building C object mysys/CMakeFiles/mysys.dir/my_gethwaddr.c.o
[ 25%] Building C object mysys/CMakeFiles/mysys.dir/my_getopt.c.o
[ 25%] Building C object mysys/CMakeFiles/mysys.dir/my_getsystime.c.o
[ 25%] Building C object mysys/CMakeFiles/mysys.dir/my_getwd.c.o
[ 25%] Building C object mysys/CMakeFiles/mysys.dir/my_compare.c.o
[ 25%] Building C object mysys/CMakeFiles/mysys.dir/my_init.c.o
[ 25%] Building C object mysys/CMakeFiles/mysys.dir/my_lib.c.o
[ 25%] Building C object mysys/CMakeFiles/mysys.dir/my_lock.c.o
[ 26%] Building C object mysys/CMakeFiles/mysys.dir/my_malloc.c.o
[ 26%] Building C object mysys/CMakeFiles/mysys.dir/my_mess.c.o
[ 26%] Building C object mysys/CMakeFiles/mysys.dir/my_mkdir.c.o
[ 26%] Building C object mysys/CMakeFiles/mysys.dir/my_mmap.c.o
[ 26%] Building C object mysys/CMakeFiles/mysys.dir/my_once.c.o
[ 26%] Building C object mysys/CMakeFiles/mysys.dir/my_open.c.o
[ 26%] Building C object mysys/CMakeFiles/mysys.dir/my_pread.c.o
[ 27%] Building C object mysys/CMakeFiles/mysys.dir/my_pthread.c.o
[ 27%] Building C object mysys/CMakeFiles/mysys.dir/my_quick.c.o
[ 27%] Building C object mysys/CMakeFiles/mysys.dir/my_read.c.o
[ 27%] Building C object mysys/CMakeFiles/mysys.dir/my_redel.c.o
[ 27%] Building C object mysys/CMakeFiles/mysys.dir/my_rename.c.o
[ 27%] Building C object mysys/CMakeFiles/mysys.dir/my_seek.c.o
[ 28%] Building C object mysys/CMakeFiles/mysys.dir/my_sleep.c.o
[ 28%] Building C object mysys/CMakeFiles/mysys.dir/my_static.c.o
[ 28%] Building C object mysys/CMakeFiles/mysys.dir/my_symlink.c.o
[ 28%] Building C object mysys/CMakeFiles/mysys.dir/my_symlink2.c.o
[ 28%] Building C object mysys/CMakeFiles/mysys.dir/my_sync.c.o
[ 28%] [ 28%] Building C object mysys/CMakeFiles/mysys.dir/my_thr_init.c.o
Building C object mysys/CMakeFiles/mysys.dir/my_write.c.o
[ 29%] Building C object mysys/CMakeFiles/mysys.dir/ptr_cmp.c.o
[ 29%] Building C object mysys/CMakeFiles/mysys.dir/queues.c.o
[ 29%] Building C object mysys/CMakeFiles/mysys.dir/stacktrace.c.o
[ 29%] Building C object mysys/CMakeFiles/mysys.dir/rijndael.c.o
[ 29%] Building C object mysys/CMakeFiles/mysys.dir/sha1.c.o
[ 29%] Building C object mysys/CMakeFiles/mysys.dir/string.c.o
[ 29%] Building C object mysys/CMakeFiles/mysys.dir/thr_alarm.c.o
[ 30%] Building C object mysys/CMakeFiles/mysys.dir/thr_lock.c.o
/home/george/dev/percona/74987/5.5/mysys/thr_alarm.c: In function ‘thr_end_alarm’:
/home/george/dev/percona/74987/5.5/mysys/thr_alarm.c:257:35: error: right-hand operand of comma expression has no effect [-Werror=unused-value]
       queue_remove(&alarm_queue,i),MYF(0);
                                   ^
cc1: all warnings being treated as errors
mysys/CMakeFiles/mysys.dir/build.make:1940: recipe for target 'mysys/CMakeFiles/mysys.dir/thr_alarm.c.o' failed
make[2]: *** [mysys/CMakeFiles/mysys.dir/thr_alarm.c.o] Error 1
make[2]: *** Waiting for unfinished jobs....
CMakeFiles/Makefile2:2484: recipe for target 'mysys/CMakeFiles/mysys.dir/all' failed
make[1]: *** [mysys/CMakeFiles/mysys.dir/all] Error 2
Makefile:133: recipe for target 'all' failed
make: *** [all] Error 2

Related branches

Percona now uses JIRA for bug reports so this bug report is migrated to: https://jira.percona.com/browse/PS-3236

To post a comment you must log in.
This report contains Public information  Edit
Everyone can see this information.

Other bug subscribers

Remote bug watches

Bug watches keep track of this bug in other bug trackers.