Build fails with CMake 2.8

Bug #1544050 reported by Chris Coulson on 2016-02-10
6
This bug affects 1 person
Affects Status Importance Assigned to Milestone
Oxide
Critical
Chris Coulson
1.13
Critical
Chris Coulson

Bug Description

dh_auto_configure -- -DENABLE_TESTS=1 -DENABLE_CHROMEDRIVER=1 -DENABLE_PROPRIETARY_CODECS=1
-- The C compiler identification is GNU 4.8.4
-- The CXX compiler identification is GNU 4.8.4
-- Check for working C compiler: /usr/bin/x86_64-linux-gnu-gcc
-- Check for working C compiler: /usr/bin/x86_64-linux-gnu-gcc -- works
-- Detecting C compiler ABI info
-- Detecting C compiler ABI info - done
-- Check for working CXX compiler: /usr/bin/x86_64-linux-gnu-g++
-- Check for working CXX compiler: /usr/bin/x86_64-linux-gnu-g++ -- works
-- Detecting CXX compiler ABI info
-- Detecting CXX compiler ABI info - done
-- Performing Test _COMPILER_HAS_CXX11_RESULT
-- Performing Test _COMPILER_HAS_CXX11_RESULT - Success
-- Found Gettext: /usr/bin/msgmerge (found version "0.18.3")
-- Installing: /«PKGBUILDDIR»/obj-x86_64-linux-gnu/out/bin/run_qmlapp.sh
CMake Error at /usr/share/cmake-2.8/Modules/WriteBasicConfigVersionFile.cmake:39 (message):
  No VERSION specified for WRITE_BASIC_CONFIG_VERSION_FILE()
Call Stack (most recent call first):
  /usr/share/cmake-2.8/Modules/CMakePackageConfigHelpers.cmake:152 (write_basic_config_version_file)
  build/cmake/OxidePackageConfigHelper.cmake:39 (write_basic_package_version_file)
  qt/CMakeLists.txt:66 (configure_and_install_package_config_file)

-- Configuring incomplete, errors occurred!
See also "/«PKGBUILDDIR»/obj-x86_64-linux-gnu/CMakeFiles/CMakeOutput.log".
dh_auto_configure: cmake .. -DCMAKE_INSTALL_PREFIX=/usr -DCMAKE_VERBOSE_MAKEFILE=ON -DCMAKE_BUILD_TYPE=None -DENABLE_TESTS=1 -DENABLE_CHROMEDRIVER=1 -DENABLE_PROPRIETARY_CODECS=1 returned exit code 1
make[1]: *** [override_dh_auto_configure] Error 2
make[1]: Leaving directory `/«PKGBUILDDIR»'
make: *** [build-arch] Error 2
dpkg-buildpackage: error: debian/rules build-arch gave error exit status 2

Changed in oxide:
assignee: nobody → Chris Coulson (chrisccoulson)
importance: Undecided → Critical
milestone: none → branch-1.14
status: New → Triaged
Changed in oxide:
status: Triaged → Fix Released
To post a comment you must log in.
This report contains Public information  Edit
Everyone can see this information.

Other bug subscribers