problem installation of openwns in ubuntu 12.04

Bug #1016553 reported by pantham on 2012-06-22
10
This bug affects 2 people
Affects Status Importance Assigned to Milestone
openWNS SDK
Undecided
Unassigned
Ubuntu
Undecided
Unassigned

Bug Description

Install file: "modules/dll/wifimac/src/helper/CholeskyDecomposition.hpp" as ".include/WIFIMAC/helper/CholeskyDecomposition.hpp"
Install file: "modules/dll/wifimac/src/management/ProtocolCalculator.hpp" as ".include/WIFIMAC/management/ProtocolCalculator.hpp"
Install file: "modules/dll/wifimac/src/management/protocolCalculatorPlugins/Duration.hpp" as ".include/WIFIMAC/management/protocolCalculatorPlugins/Duration.hpp"
Install file: "modules/dll/wifimac/src/management/protocolCalculatorPlugins/ErrorProbability.hpp" as ".include/WIFIMAC/management/protocolCalculatorPlugins/ErrorProbability.hpp"
Install file: "modules/dll/wifimac/src/management/protocolCalculatorPlugins/FrameLength.hpp" as ".include/WIFIMAC/management/protocolCalculatorPlugins/FrameLength.hpp"
g++ -o .build/dbg/openwns-wifimac/src/convergence/PhyUser.os -c -g -O0 -fno-inline -fPIC -I.include -I/usr/include/python2.7 modules/dll/wifimac/src/convergence/PhyUser.cpp
Install file: ".build/dbg/openwns-tcp/libtcp.so" as "sandbox/dbg/lib/libtcp.so"
modules/dll/wifimac/src/Layer2.cpp: In member function 'void wifimac::Layer2::registerManager(wifimac::lowerMAC::Manager*, wns::service::dll::UnicastAddress)':
modules/dll/wifimac/src/Layer2.cpp:125:68: error: cannot call constructor 'wifimac::pathselection::Metric::Metric' directly [-fpermissive]
modules/dll/wifimac/src/Layer2.cpp:125:68: error: for a function-style cast, remove the redundant '::Metric' [-fpermissive]
Install file: "modules/dll/wifimac/src/convergence/ErrorModelling.hpp" as ".include/WIFIMAC/convergence/ErrorModelling.hpp"
g++ -o .build/dbg/openwns-wifimac/src/convergence/PhyMode.os -c -g -O0 -fno-inline -fPIC -I.include -I/usr/include/python2.7 modules/dll/wifimac/src/convergence/PhyMode.cpp
scons: *** [.build/dbg/openwns-wifimac/src/Layer2.os] Error 1
scons: building terminated because of errors.

Fabio Marconi (fabiomarconi) wrote :

closed ubuntu task
---
Ubuntu Bug Squad volunteer triager
http://wiki.ubuntu.com/BugSquad

Changed in ubuntu:
status: New → Invalid
To post a comment you must log in.
This report contains Public information  Edit
Everyone can see this information.

Other bug subscribers