Python 2.6 gate broken due to no workspace found

Bug #1255041 reported by Sylvain Bauza on 2013-11-26
8
This bug affects 1 person
Affects Status Importance Assigned to Milestone
OpenStack Core Infrastructure
Fix Released
Critical
Monty Taylor

Bug Description

Hi,

Py26 gate is currently broken for all projects with same output :
2013-11-26 07:23:37.957 | Started by user anonymous
2013-11-26 07:23:37.964 | [EnvInject] - Loading node environment variables.
2013-11-26 07:23:38.109 | [EnvInject] - [ERROR] - SEVERE ERROR occurs: java.io.IOException: Remote call on centos6-4 failed
2013-11-26 07:23:38.110 | [SCP] Connecting to static.openstack.org
2013-11-26 07:23:39.729 | [SCP] No workspace found, files cannot be copied. Probably an error communicating with slave.
2013-11-26 07:23:39.730 | [SCP] No workspace found, files cannot be copied. Probably an error communicating with slave.
2013-11-26 07:23:39.731 | [SCP] No workspace found, files cannot be copied. Probably an error communicating with slave.
2013-11-26 07:23:39.731 | [SCP] No workspace found, files cannot be copied. Probably an error communicating with slave.
2013-11-26 07:23:39.740 | [SCP] Connecting to static.openstack.org
2013-11-26 07:23:40.913 | [SCP] Trying to create /srv/static/logs/49/57049/2/gate/gate-swift-python26/c1aedf1
2013-11-26 07:23:40.938 | [SCP] Copying console log.
2013-11-26 07:23:41.178 | Finished: FAILURE

Steven Hardy (shardy) wrote :
Monty Taylor (mordred) wrote :

Restarted slave agent on centos6-4 - all seems to be good now.

Changed in openstack-ci:
assignee: nobody → Monty Taylor (mordred)
importance: Undecided → Critical
status: New → Fix Released
To post a comment you must log in.
This report contains Public information  Edit
Everyone can see this information.

Other bug subscribers