Cannot compile

Bug #1042694 reported by hifi25nl on 2012-08-28
This bug affects 5 people
Affects Status Importance Assigned to Milestone

Bug Description

[olmeda@archlinux nwfermi-]$ make
make -C /lib/modules/3.5.3-1-ARCH/build M=/home/olmeda/Downloads/Temp/nwfermi- modules
make[1]: Entering directory `/usr/src/linux-3.5.3-1-ARCH'
  CC [M] /home/olmeda/Downloads/Temp/nwfermi-
/home/olmeda/Downloads/Temp/nwfermi- In function ‘fermi_open’:
/home/olmeda/Downloads/Temp/nwfermi- error: implicit declaration of function ‘err’ [-Werror=implicit-function-declaration]
cc1: some warnings being treated as errors
make[2]: *** [/home/olmeda/Downloads/Temp/nwfermi-] Error 1
make[1]: *** [_module_/home/olmeda/Downloads/Temp/nwfermi-] Error 2
make[1]: Leaving directory `/usr/src/linux-3.5.3-1-ARCH'
make: *** [all] Error 2

Only after kernel 3.5.3-1

hifi25nl (hifi25nl) wrote :

Change "err" in "pr_er"r in nw-fermi.c

hifi25nl (hifi25nl) wrote :

Change "err" in "pr_err" in nw-fermi.c

djp (djpnewton) on 2012-10-22
Changed in nwfermi:
assignee: nobody → djp (djpnewton)
importance: Undecided → High
djp (djpnewton) on 2012-10-22
Changed in nwfermi:
status: New → Fix Committed
Roland G (rolandg) on 2013-01-22
Changed in nwfermi:
status: Fix Committed → Fix Released
Roland G (rolandg) wrote :

Sorry didn't want to change the status.
Please undo!!

barry (chocky763) wrote :

Is anyone still looking into this?
I have just encountered this exact problem

hifi25nl (hifi25nl) wrote :

Some news? Some new release?

To post a comment you must log in.
This report contains Public information  Edit
Everyone can see this information.

Other bug subscribers