Nextwindow Fermi Driver

Cannot compile

Reported by hifi25nl on 2012-08-28
30
This bug affects 5 people
Affects Status Importance Assigned to Milestone
nwfermi
High
djp

Bug Description

[olmeda@archlinux nwfermi-0.6.5.0]$ make
make -C /lib/modules/3.5.3-1-ARCH/build M=/home/olmeda/Downloads/Temp/nwfermi-0.6.5.0_amd64/usr/src/nwfermi-0.6.5.0 modules
make[1]: Entering directory `/usr/src/linux-3.5.3-1-ARCH'
  CC [M] /home/olmeda/Downloads/Temp/nwfermi-0.6.5.0_amd64/usr/src/nwfermi-0.6.5.0/nw-fermi.o
/home/olmeda/Downloads/Temp/nwfermi-0.6.5.0_amd64/usr/src/nwfermi-0.6.5.0/nw-fermi.c: In function ‘fermi_open’:
/home/olmeda/Downloads/Temp/nwfermi-0.6.5.0_amd64/usr/src/nwfermi-0.6.5.0/nw-fermi.c:268:3: error: implicit declaration of function ‘err’ [-Werror=implicit-function-declaration]
cc1: some warnings being treated as errors
make[2]: *** [/home/olmeda/Downloads/Temp/nwfermi-0.6.5.0_amd64/usr/src/nwfermi-0.6.5.0/nw-fermi.o] Error 1
make[1]: *** [_module_/home/olmeda/Downloads/Temp/nwfermi-0.6.5.0_amd64/usr/src/nwfermi-0.6.5.0] Error 2
make[1]: Leaving directory `/usr/src/linux-3.5.3-1-ARCH'
make: *** [all] Error 2

Only after kernel 3.5.3-1

hifi25nl (hifi25nl) wrote :

Change "err" in "pr_er"r in nw-fermi.c

hifi25nl (hifi25nl) wrote :

Change "err" in "pr_err" in nw-fermi.c

djp (djpnewton) on 2012-10-22
Changed in nwfermi:
assignee: nobody → djp (djpnewton)
importance: Undecided → High
djp (djpnewton) on 2012-10-22
Changed in nwfermi:
status: New → Fix Committed
Changed in nwfermi:
status: Fix Committed → Fix Released
Roland Gritzer (gritzer-roland) wrote :

Sorry didn't want to change the status.
Please undo!!

barry (chocky763) wrote :

Is anyone still looking into this?
I have just encountered this exact problem

hifi25nl (hifi25nl) wrote :

Some news? Some new release?

To post a comment you must log in.
This report contains Public information  Edit
Everyone can see this information.

Other bug subscribers